Uploaded image for project: 'JDK'
  1. JDK
  2. JDK-8022159

[macosx] closed/javax/swing/SwingWorker/4681682/SwingWorkerTest.java fails

    Details

      Description

      Fails on jdk1.8.0b100_compiler_upgrades, jdk1.8.0b99. Passes with jdk1.7.0_25b15

      ----------System.out:(0/0)----------
      ----------System.err:(156/12900)----------
      java.lang.RuntimeException: 4 tests failed.
      testWorkFlow:
      java.util.concurrent.TimeoutException
      at java.util.concurrent.Exchanger.exchange(Exchanger.java:687)
      at SwingWorkerTest.testWorkFlow(SwingWorkerTest.java:181)
      at sun.reflect.NativeMethodAccessorImpl.invoke0(Native Method)
      at sun.reflect.NativeMethodAccessorImpl.invoke(NativeMethodAccessorImpl.java:57)
      at sun.reflect.DelegatingMethodAccessorImpl.invoke(DelegatingMethodAccessorImpl.java:43)
      at java.lang.reflect.Method.invoke(Method.java:491)
      at TestCase.runTest(TestCase.java:80)
      at TestCase.runAllTests(TestCase.java:53)
      at SwingWorkerTest.main(SwingWorkerTest.java:22)
      at sun.reflect.NativeMethodAccessorImpl.invoke0(Native Method)
      at sun.reflect.NativeMethodAccessorImpl.invoke(NativeMethodAccessorImpl.java:57)
      at sun.reflect.DelegatingMethodAccessorImpl.invoke(DelegatingMethodAccessorImpl.java:43)
      at java.lang.reflect.Method.invoke(Method.java:491)
      at com.sun.javatest.regtest.MainWrapper$MainThread.run(MainWrapper.java:94)
      at java.lang.Thread.run(Thread.java:724)
      testDone:
      java.util.concurrent.TimeoutException
      at java.util.concurrent.Exchanger.exchange(Exchanger.java:687)
      at SwingWorkerTest.testDone(SwingWorkerTest.java:107)
      at sun.reflect.NativeMethodAccessorImpl.invoke0(Native Method)
      at sun.reflect.NativeMethodAccessorImpl.invoke(NativeMethodAccessorImpl.java:57)
      at sun.reflect.DelegatingMethodAccessorImpl.invoke(DelegatingMethodAccessorImpl.java:43)
      at java.lang.reflect.Method.invoke(Method.java:491)
      at TestCase.runTest(TestCase.java:80)
      at TestCase.runAllTests(TestCase.java:53)
      at SwingWorkerTest.main(SwingWorkerTest.java:22)
      at sun.reflect.NativeMethodAccessorImpl.invoke0(Native Method)
      at sun.reflect.NativeMethodAccessorImpl.invoke(NativeMethodAccessorImpl.java:57)
      at sun.reflect.DelegatingMethodAccessorImpl.invoke(DelegatingMethodAccessorImpl.java:43)
      at java.lang.reflect.Method.invoke(Method.java:491)
      at com.sun.javatest.regtest.MainWrapper$MainThread.run(MainWrapper.java:94)
      at java.lang.Thread.run(Thread.java:724)
      testPublishAndProcess:
      java.lang.RuntimeException
      at Assert.fail(Assert.java:13)
      at Assert.assertTrue(Assert.java:22)
      at Assert.assertTrue(Assert.java:29)
      at SwingWorkerTest.testPublishAndProcess(SwingWorkerTest.java:81)
      at sun.reflect.NativeMethodAccessorImpl.invoke0(Native Method)
      at sun.reflect.NativeMethodAccessorImpl.invoke(NativeMethodAccessorImpl.java:57)
      at sun.reflect.DelegatingMethodAccessorImpl.invoke(DelegatingMethodAccessorImpl.java:43)
      at java.lang.reflect.Method.invoke(Method.java:491)
      at TestCase.runTest(TestCase.java:80)
      at TestCase.runAllTests(TestCase.java:53)
      at SwingWorkerTest.main(SwingWorkerTest.java:22)
      at sun.reflect.NativeMethodAccessorImpl.invoke0(Native Method)
      at sun.reflect.NativeMethodAccessorImpl.invoke(NativeMethodAccessorImpl.java:57)
      at sun.reflect.DelegatingMethodAccessorImpl.invoke(DelegatingMethodAccessorImpl.java:43)
      at java.lang.reflect.Method.invoke(Method.java:491)
      at com.sun.javatest.regtest.MainWrapper$MainThread.run(MainWrapper.java:94)
      at java.lang.Thread.run(Thread.java:724)
      testPropertyChange:
      java.util.concurrent.TimeoutException
      at java.util.concurrent.Exchanger.exchange(Exchanger.java:687)
      at SwingWorkerTest.testPropertyChange(SwingWorkerTest.java:139)
      at sun.reflect.NativeMethodAccessorImpl.invoke0(Native Method)
      at sun.reflect.NativeMethodAccessorImpl.invoke(NativeMethodAccessorImpl.java:57)
      at sun.reflect.DelegatingMethodAccessorImpl.invoke(DelegatingMethodAccessorImpl.java:43)
      at java.lang.reflect.Method.invoke(Method.java:491)
      at TestCase.runTest(TestCase.java:80)
      at TestCase.runAllTests(TestCase.java:53)
      at SwingWorkerTest.main(SwingWorkerTest.java:22)
      at sun.reflect.NativeMethodAccessorImpl.invoke0(Native Method)
      at sun.reflect.NativeMethodAccessorImpl.invoke(NativeMethodAccessorImpl.java:57)
      at sun.reflect.DelegatingMethodAccessorImpl.invoke(DelegatingMethodAccessorImpl.java:43)
      at java.lang.reflect.Method.invoke(Method.java:491)
      at com.sun.javatest.regtest.MainWrapper$MainThread.run(MainWrapper.java:94)
      at java.lang.Thread.run(Thread.java:724)

      at TestCase.runAllTests(TestCase.java:69)
      at SwingWorkerTest.main(SwingWorkerTest.java:22)
      at sun.reflect.NativeMethodAccessorImpl.invoke0(Native Method)
      at sun.reflect.NativeMethodAccessorImpl.invoke(NativeMethodAccessorImpl.java:57)
      at sun.reflect.DelegatingMethodAccessorImpl.invoke(DelegatingMethodAccessorImpl.java:43)
      at java.lang.reflect.Method.invoke(Method.java:491)
      at com.sun.javatest.regtest.MainWrapper$MainThread.run(MainWrapper.java:94)
      at java.lang.Thread.run(Thread.java:724)

      JavaTest Message: Test threw exception: java.lang.RuntimeException: 4 tests failed.
      testWorkFlow:
      java.util.concurrent.TimeoutException
      at java.util.concurrent.Exchanger.exchange(Exchanger.java:687)
      at SwingWorkerTest.testWorkFlow(SwingWorkerTest.java:181)
      at sun.reflect.NativeMethodAccessorImpl.invoke0(Native Method)
      at sun.reflect.NativeMethodAccessorImpl.invoke(NativeMethodAccessorImpl.java:57)
      at sun.reflect.DelegatingMethodAccessorImpl.invoke(DelegatingMethodAccessorImpl.java:43)
      at java.lang.reflect.Method.invoke(Method.java:491)
      at TestCase.runTest(TestCase.java:80)
      at TestCase.runAllTests(TestCase.java:53)
      at SwingWorkerTest.main(SwingWorkerTest.java:22)
      at sun.reflect.NativeMethodAccessorImpl.invoke0(Native Method)
      at sun.reflect.NativeMethodAccessorImpl.invoke(NativeMethodAccessorImpl.java:57)
      at sun.reflect.DelegatingMethodAccessorImpl.invoke(DelegatingMethodAccessorImpl.java:43)
      at java.lang.reflect.Method.invoke(Method.java:491)
      at com.sun.javatest.regtest.MainWrapper$MainThread.run(MainWrapper.java:94)
      at java.lang.Thread.run(Thread.java:724)
      testDone:
      java.util.concurrent.TimeoutException
      at java.util.concurrent.Exchanger.exchange(Exchanger.java:687)
      at SwingWorkerTest.testDone(SwingWorkerTest.java:107)
      at sun.reflect.NativeMethodAccessorImpl.invoke0(Native Method)
      at sun.reflect.NativeMethodAccessorImpl.invoke(NativeMethodAccessorImpl.java:57)
      at sun.reflect.DelegatingMethodAccessorImpl.invoke(DelegatingMethodAccessorImpl.java:43)
      at java.lang.reflect.Method.invoke(Method.java:491)
      at TestCase.runTest(TestCase.java:80)
      at TestCase.runAllTests(TestCase.java:53)
      at SwingWorkerTest.main(SwingWorkerTest.java:22)
      at sun.reflect.NativeMethodAccessorImpl.invoke0(Native Method)
      at sun.reflect.NativeMethodAccessorImpl.invoke(NativeMethodAccessorImpl.java:57)
      at sun.reflect.DelegatingMethodAccessorImpl.invoke(DelegatingMethodAccessorImpl.java:43)
      at java.lang.reflect.Method.invoke(Method.java:491)
      at com.sun.javatest.regtest.MainWrapper$MainThread.run(MainWrapper.java:94)
      at java.lang.Thread.run(Thread.java:724)
      testPublishAndProcess:
      java.lang.RuntimeException
      at Assert.fail(Assert.java:13)
      at Assert.assertTrue(Assert.java:22)
      at Assert.assertTrue(Assert.java:29)
      at SwingWorkerTest.testPublishAndProcess(SwingWorkerTest.java:81)
      at sun.reflect.NativeMethodAccessorImpl.invoke0(Native Method)
      at sun.reflect.NativeMethodAccessorImpl.invoke(NativeMethodAccessorImpl.java:57)
      at sun.reflect.DelegatingMethodAccessorImpl.invoke(DelegatingMethodAccessorImpl.java:43)
      at java.lang.reflect.Method.invoke(Method.java:491)
      at TestCase.runTest(TestCase.java:80)
      at TestCase.runAllTests(TestCase.java:53)
      at SwingWorkerTest.main(SwingWorkerTest.java:22)
      at sun.reflect.NativeMethodAccessorImpl.invoke0(Native Method)
      at sun.reflect.NativeMethodAccessorImpl.invoke(NativeMethodAccessorImpl.java:57)
      at sun.reflect.DelegatingMethodAccessorImpl.invoke(DelegatingMethodAccessorImpl.java:43)
      at java.lang.reflect.Method.invoke(Method.java:491)
      at com.sun.javatest.regtest.MainWrapper$MainThread.run(MainWrapper.java:94)
      at java.lang.Thread.run(Thread.java:724)
      testPropertyChange:
      java.util.concurrent.TimeoutException
      at java.util.concurrent.Exchanger.exchange(Exchanger.java:687)
      at SwingWorkerTest.testPropertyChange(SwingWorkerTest.java:139)
      at sun.reflect.NativeMethodAccessorImpl.invoke0(Native Method)
      at sun.reflect.NativeMethodAccessorImpl.invoke(NativeMethodAccessorImpl.java:57)
      at sun.reflect.DelegatingMethodAccessorImpl.invoke(DelegatingMethodAccessorImpl.java:43)
      at java.lang.reflect.Method.invoke(Method.java:491)
      at TestCase.runTest(TestCase.java:80)
      at TestCase.runAllTests(TestCase.java:53)
      at SwingWorkerTest.main(SwingWorkerTest.java:22)
      at sun.reflect.NativeMethodAccessorImpl.invoke0(Native Method)
      at sun.reflect.NativeMethodAccessorImpl.invoke(NativeMethodAccessorImpl.java:57)
      at sun.reflect.DelegatingMethodAccessorImpl.invoke(DelegatingMethodAccessorImpl.java:43)
      at java.lang.reflect.Method.invoke(Method.java:491)
      at com.sun.javatest.regtest.MainWrapper$MainThread.run(MainWrapper.java:94)
      at java.lang.Thread.run(Thread.java:724)

      JavaTest Message: shutting down test

      STATUS:Failed.`main' threw exception: java.lang.RuntimeException: 4 tests failed. testWorkFlow: java.util.concurrent.TimeoutException at java.util.concurrent.Exchanger.exchange(Exchanger.java:687) at SwingWorkerTest.testWorkFlow(SwingWorkerTest.java:181) at sun.reflect.NativeMethodAccessorImpl.invoke0(Native Method) at sun.reflect.NativeMethodAccessorImpl.invoke(NativeMethodAccessorImpl.java:57) at sun.reflect.DelegatingMethodAccessorImpl.invoke(DelegatingMethodAccessorImpl.java:43) at java.lang.reflect.Method.invoke(Method.java:491) at TestCase.runTest(TestCase.java:80) at TestCase.runAllTests(TestCase.java:53) at SwingWorkerTest.main(SwingWorkerTest.java:22) at sun.reflect.NativeMethodAccessorImpl.invoke0(Native Method) at sun.reflect.NativeMethodAccessorImpl.invoke(NativeMethodAccessorImpl.java:57) at sun.reflect.DelegatingMethodAccessorImpl.invoke(DelegatingMethodAccessorImpl.java:43) at java.lang.reflect.Method.invoke(Method.java:491) at com.sun.javatest.regtest.MainWrapper$MainThread.run(MainWrapper.java:94) at java.lang.Thread.run(Thread.java:724) testDone: java.util.concurrent.TimeoutException at java.util.concurrent.Exchanger.exchange(Exchanger.java:687) at SwingWorkerTest.testDone(SwingWorkerTest.java:107) at sun.reflect.NativeMethodAccessorImpl.invoke0(Native Method) at sun.reflect.NativeMethodAccessorImpl.invoke(NativeMethodAccessorImpl.java:57) at sun.reflect.DelegatingMethodAccessorImpl.invoke(DelegatingMethodAccessorImpl.java:43) at java.lang.reflect.Method.invoke(Method.java:491) at TestCase.runTest(TestCase.java:80) at TestCase.runAllTests(TestCase.java:53) at SwingWorkerTest.main(SwingWorkerTest.java:22) at sun.reflect.NativeMethodAccessorImpl.invoke0(Native Method) at sun.reflect.NativeMethodAccessorImpl.invoke(NativeMethodAccessorImpl.java:57) at sun.reflect.DelegatingMethodAccessorImpl.invoke(DelegatingMethodAccessorImpl.java:43) at java.lang.reflect.Method.invoke(Method.java:491) at com.sun.javatest.regtest.MainWrapper$MainThread.run(MainWrapper.java:94) at java.lang.Thread.run(Thread.java:724) testPublishAndProcess: java.lang.RuntimeException at Assert.fail(Assert.java:13) at Assert.assertTrue(Assert.java:22) at Assert.assertTrue(Assert.java:29) at SwingWorkerTest.testPublishAndProcess(SwingWorkerTest.java:81) at sun.reflect.NativeMethodAccessorImpl.invoke0(Native Method) at sun.reflect.NativeMethodAccessorImpl.invoke(NativeMethodAccessorImpl.java:57) at sun.reflect.DelegatingMethodAccessorImpl.invoke(DelegatingMethodAccessorImpl.java:43) at java.lang.reflect.Method.invoke(Method.java:491) at TestCase.runTest(TestCase.java:80) at TestCase.runAllTests(TestCase.java:53) at SwingWorkerTest.main(SwingWorkerTest.java:22) at sun.reflect.NativeMethodAccessorImpl.invoke0(Native Method) at sun.reflect.NativeMethodAccessorImpl.invoke(NativeMethodAccessorImpl.java:57) at sun.reflect.DelegatingMethodAccessorImpl.invoke(DelegatingMethodAccessorImpl.java:43) at java.lang.reflect.Method.invoke(Method.java:491) at com.sun.javatest.regtest.MainWrapper$MainThread.run(MainWrapper.java:94) at java.lang.Thread.run(Thread.java:724) testPropertyChange: java.util.concurrent.TimeoutException at java.util.concurrent.Exchanger.exchange(Exchanger.java:687) at SwingWorkerTest.testPropertyChange(SwingWorkerTest.java:139) at sun.reflect.NativeMethodAccessorImpl.invoke0(Native Method) at sun.reflect.NativeMethodAccessorImpl.invoke(NativeMethodAccessorImpl.java:57) at sun.reflect.DelegatingMethodAccessorImpl.invoke(DelegatingMethodAccessorImpl.java:43) at java.lang.reflect.Method.invoke(Method.java:491) at TestCase.runTest(TestCase.java:80) at TestCase.runAllTests(TestCase.java:53) at SwingWorkerTest.main(SwingWorkerTest.java:22) at sun.reflect.NativeMethodAccessorImpl.invoke0(Native Method) at sun.reflect.NativeMethodAccessorImpl.invoke(NativeMethodAccessorImpl.java:57) at sun.reflect.DelegatingMethodAccessorImpl.invoke(DelegatingMethodAccessorImpl.java:43) at java.lang.reflect.Method.invoke(Method.java:491) at com.sun.javatest.regtest.MainWrapper$MainThread.run(MainWrapper.java:94) at java.lang.Thread.run(Thread.java:724)
      result: Failed. Execution failed: `main' threw exception: java.lang.RuntimeException: 4 tests failed. testWorkFlow: java.util.concurrent.TimeoutException at java.util.concurrent.Exchanger.exchange(Exchanger.java:687) at SwingWorkerTest.testWorkFlow(SwingWorkerTest.java:181) at sun.reflect.NativeMethodAccessorImpl.invoke0(Native Method) at sun.reflect.NativeMethodAccessorImpl.invoke(NativeMethodAccessorImpl.java:57) at sun.reflect.DelegatingMethodAccessorImpl.invoke(DelegatingMethodAccessorImpl.java:43) at java.lang.reflect.Method.invoke(Method.java:491) at TestCase.runTest(TestCase.java:80) at TestCase.runAllTests(TestCase.java:53) at SwingWorkerTest.main(SwingWorkerTest.java:22) at sun.reflect.NativeMethodAccessorImpl.invoke0(Native Method) at sun.reflect.NativeMethodAccessorImpl.invoke(NativeMethodAccessorImpl.java:57) at sun.reflect.DelegatingMethodAccessorImpl.invoke(DelegatingMethodAccessorImpl.java:43) at java.lang.reflect.Method.invoke(Method.java:491) at com.sun.javatest.regtest.MainWrapper$MainThread.run(MainWrapper.java:94) at java.lang.Thread.run(Thread.java:724) testDone: java.util.concurrent.TimeoutException at java.util.concurrent.Exchanger.exchange(Exchanger.java:687) at SwingWorkerTest.testDone(SwingWorkerTest.java:107) at sun.reflect.NativeMethodAccessorImpl.invoke0(Native Method) at sun.reflect.NativeMethodAccessorImpl.invoke(NativeMethodAccessorImpl.java:57) at sun.reflect.DelegatingMethodAccessorImpl.invoke(DelegatingMethodAccessorImpl.java:43) at java.lang.reflect.Method.invoke(Method.java:491) at TestCase.runTest(TestCase.java:80) at TestCase.runAllTests(TestCase.java:53) at SwingWorkerTest.main(SwingWorkerTest.java:22) at sun.reflect.NativeMethodAccessorImpl.invoke0(Native Method) at sun.reflect.NativeMethodAccessorImpl.invoke(NativeMethodAccessorImpl.java:57) at sun.reflect.DelegatingMethodAccessorImpl.invoke(DelegatingMethodAccessorImpl.java:43) at java.lang.reflect.Method.invoke(Method.java:491) at com.sun.javatest.regtest.MainWrapper$MainThread.run(MainWrapper.java:94) at java.lang.Thread.run(Thread.java:724) testPublishAndProcess: java.lang.RuntimeException at Assert.fail(Assert.java:13) at Assert.assertTrue(Assert.java:22) at Assert.assertTrue(Assert.java:29) at SwingWorkerTest.testPublishAndProcess(SwingWorkerTest.java:81) at sun.reflect.NativeMethodAccessorImpl.invoke0(Native Method) at sun.reflect.NativeMethodAccessorImpl.invoke(NativeMethodAccessorImpl.java:57) at sun.reflect.DelegatingMethodAccessorImpl.invoke(DelegatingMethodAccessorImpl.java:43) at java.lang.reflect.Method.invoke(Method.java:491) at TestCase.runTest(TestCase.java:80) at TestCase.runAllTests(TestCase.java:53) at SwingWorkerTest.main(SwingWorkerTest.java:22) at sun.reflect.NativeMethodAccessorImpl.invoke0(Native Method) at sun.reflect.NativeMethodAccessorImpl.invoke(NativeMethodAccessorImpl.java:57) at sun.reflect.DelegatingMethodAccessorImpl.invoke(DelegatingMethodAccessorImpl.java:43) at java.lang.reflect.Method.invoke(Method.java:491) at com.sun.javatest.regtest.MainWrapper$MainThread.run(MainWrapper.java:94) at java.lang.Thread.run(Thread.java:724) testPropertyChange: java.util.concurrent.TimeoutException at java.util.concurrent.Exchanger.exchange(Exchanger.java:687) at SwingWorkerTest.testPropertyChange(SwingWorkerTest.java:139) at sun.reflect.NativeMethodAccessorImpl.invoke0(Native Method) at sun.reflect.NativeMethodAccessorImpl.invoke(NativeMethodAccessorImpl.java:57) at sun.reflect.DelegatingMethodAccessorImpl.invoke(DelegatingMethodAccessorImpl.java:43) at java.lang.reflect.Method.invoke(Method.java:491) at TestCase.runTest(TestCase.java:80) at TestCase.runAllTests(TestCase.java:53) at SwingWorkerTest.main(SwingWorkerTest.java:22) at sun.reflect.NativeMethodAccessorImpl.invoke0(Native Method) at sun.reflect.NativeMethodAccessorImpl.invoke(NativeMethodAccessorImpl.java:57) at sun.reflect.DelegatingMethodAccessorImpl.invoke(DelegatingMethodAccessorImpl.java:43) at java.lang.reflect.Method.invoke(Method.java:491) at com.sun.javatest.regtest.MainWrapper$MainThread.run(MainWrapper.java:94) at java.lang.Thread.run(Thread.java:724)


      test result: Failed. Execution failed: `main' threw exception: java.lang.RuntimeException: 4 tests failed. testWorkFlow: java.util.concurrent.TimeoutException at java.util.concurrent.Exchanger.exchange(Exchanger.java:687) at SwingWorkerTest.testWorkFlow(SwingWorkerTest.java:181) at sun.reflect.NativeMethodAccessorImpl.invoke0(Native Method) at sun.reflect.NativeMethodAccessorImpl.invoke(NativeMethodAccessorImpl.java:57) at sun.reflect.DelegatingMethodAccessorImpl.invoke(DelegatingMethodAccessorImpl.java:43) at java.lang.reflect.Method.invoke(Method.java:491) at TestCase.runTest(TestCase.java:80) at TestCase.runAllTests(TestCase.java:53) at SwingWorkerTest.main(SwingWorkerTest.java:22) at sun.reflect.NativeMethodAccessorImpl.invoke0(Native Method) at sun.reflect.NativeMethodAccessorImpl.invoke(NativeMethodAccessorImpl.java:57) at sun.reflect.DelegatingMethodAccessorImpl.invoke(DelegatingMethodAccessorImpl.java:43) at java.lang.reflect.Method.invoke(Method.java:491) at com.sun.javatest.regtest.MainWrapper$MainThread.run(MainWrapper.java:94) at java.lang.Thread.run(Thread.java:724) testDone: java.util.concurrent.TimeoutException at java.util.concurrent.Exchanger.exchange(Exchanger.java:687) at SwingWorkerTest.testDone(SwingWorkerTest.java:107) at sun.reflect.NativeMethodAccessorImpl.invoke0(Native Method) at sun.reflect.NativeMethodAccessorImpl.invoke(NativeMethodAccessorImpl.java:57) at sun.reflect.DelegatingMethodAccessorImpl.invoke(DelegatingMethodAccessorImpl.java:43) at java.lang.reflect.Method.invoke(Method.java:491) at TestCase.runTest(TestCase.java:80) at TestCase.runAllTests(TestCase.java:53) at SwingWorkerTest.main(SwingWorkerTest.java:22) at sun.reflect.NativeMethodAccessorImpl.invoke0(Native Method) at sun.reflect.NativeMethodAccessorImpl.invoke(NativeMethodAccessorImpl.java:57) at sun.reflect.DelegatingMethodAccessorImpl.invoke(DelegatingMethodAccessorImpl.java:43) at java.lang.reflect.Method.invoke(Method.java:491) at com.sun.javatest.regtest.MainWrapper$MainThread.run(MainWrapper.java:94) at java.lang.Thread.run(Thread.java:724) testPublishAndProcess: java.lang.RuntimeException at Assert.fail(Assert.java:13) at Assert.assertTrue(Assert.java:22) at Assert.assertTrue(Assert.java:29) at SwingWorkerTest.testPublishAndProcess(SwingWorkerTest.java:81) at sun.reflect.NativeMethodAccessorImpl.invoke0(Native Method) at sun.reflect.NativeMethodAccessorImpl.invoke(NativeMethodAccessorImpl.java:57) at sun.reflect.DelegatingMethodAccessorImpl.invoke(DelegatingMethodAccessorImpl.java:43) at java.lang.reflect.Method.invoke(Method.java:491) at TestCase.runTest(TestCase.java:80) at TestCase.runAllTests(TestCase.java:53) at SwingWorkerTest.main(SwingWorkerTest.java:22) at sun.reflect.NativeMethodAccessorImpl.invoke0(Native Method) at sun.reflect.NativeMethodAccessorImpl.invoke(NativeMethodAccessorImpl.java:57) at sun.reflect.DelegatingMethodAccessorImpl.invoke(DelegatingMethodAccessorImpl.java:43) at java.lang.reflect.Method.invoke(Method.java:491) at com.sun.javatest.regtest.MainWrapper$MainThread.run(MainWrapper.java:94) at java.lang.Thread.run(Thread.java:724) testPropertyChange: java.util.concurrent.TimeoutException at java.util.concurrent.Exchanger.exchange(Exchanger.java:687) at SwingWorkerTest.testPropertyChange(SwingWorkerTest.java:139) at sun.reflect.NativeMethodAccessorImpl.invoke0(Native Method) at sun.reflect.NativeMethodAccessorImpl.invoke(NativeMethodAccessorImpl.java:57) at sun.reflect.DelegatingMethodAccessorImpl.invoke(DelegatingMethodAccessorImpl.java:43) at java.lang.reflect.Method.invoke(Method.java:491) at TestCase.runTest(TestCase.java:80) at TestCase.runAllTests(TestCase.java:53) at SwingWorkerTest.main(SwingWorkerTest.java:22) at sun.reflect.NativeMethodAccessorImpl.invoke0(Native Method) at sun.reflect.NativeMethodAccessorImpl.invoke(NativeMethodAccessorImpl.java:57) at sun.reflect.DelegatingMethodAccessorImpl.invoke(DelegatingMethodAccessorImpl.java:43) at java.lang.reflect.Method.invoke(Method.java:491) at com.sun.javatest.regtest.MainWrapper$MainThread.run(MainWrapper.java:94) at java.lang.Thread.run(Thread.java:724)

        Attachments

          Activity

            People

            • Assignee:
              pchelko Petr Pchelko (Inactive)
              Reporter:
              asakharu Aleksandr Sakharuk (Inactive)
            • Votes:
              0 Vote for this issue
              Watchers:
              7 Start watching this issue

              Dates

              • Created:
                Updated:
                Resolved: