Uploaded image for project: 'JDK'
  1. JDK
  2. JDK-8022546

tools/launcher/VersionCheck.java fails

    Details

      Description

      Test fails on jdk1.8.0b100, jdk1.8.0b99, jdk1.7.0_25b15

      ----------System.out:(70/5350)----------
      Testing (-J-version): /export/local/aurora/CommonData/jdk/bin/jdeps
      Testing (-J-version): /export/local/aurora/CommonData/jdk/bin/jinfo
      Testing (-J-version): /export/local/aurora/CommonData/jdk/bin/jdb
      Testing (-J-version): /export/local/aurora/CommonData/jdk/bin/jps
      Testing (-J-version): /export/local/aurora/CommonData/jdk/bin/extcheck
      Testing (-J-version): /export/local/aurora/CommonData/jdk/bin/javadoc
      Testing (-J-version): /export/local/aurora/CommonData/jdk/bin/schemagen
      Testing (-J-version): /export/local/aurora/CommonData/jdk/bin/keytool
      Testing (-J-version): /export/local/aurora/CommonData/jdk/bin/jsadebugd
      Testing (-J-version): /export/local/aurora/CommonData/jdk/bin/servertool
      Testing (-J-version): /export/local/aurora/CommonData/jdk/bin/jstat
      Testing (-J-version): /export/local/aurora/CommonData/jdk/bin/javac
      Testing (-J-version): /export/local/aurora/CommonData/jdk/bin/idlj
      Testing (-J-version): /export/local/aurora/CommonData/jdk/bin/jmc.ini
      Error: /export/local/aurora/CommonData/jdk/bin/jmc.ini fails -J-version comparison
      Expected:
      java version "1.8.0-ea"
      Java(TM) SE Runtime Environment (build 1.8.0-ea-b100)
      Actual:
      /export/local/aurora/CommonData/jdk/bin/jmc.ini: line 1: -startup: command not found
      /export/local/aurora/CommonData/jdk/bin/jmc.ini: line 2: ../lib/missioncontrol/plugins/org.eclipse.equinox.launcher_1.3.0.v20120522-1813.jar: No such file or directory
      /export/local/aurora/CommonData/jdk/bin/jmc.ini: line 3: --launcher.library: command not found
      /export/local/aurora/CommonData/jdk/bin/jmc.ini: line 4: ../lib/missioncontrol/plugins/org.eclipse.equinox.launcher.gtk.linux.x86_64_1.1.200.v20120913-144807: No such file or directory
      /export/local/aurora/CommonData/jdk/bin/jmc.ini: line 5: -vm: command not found
      /export/local/aurora/CommonData/jdk/bin/jmc.ini: line 6: ./java: No such file or directory
      /export/local/aurora/CommonData/jdk/bin/jmc.ini: line 7: -vmargs: command not found
      /export/local/aurora/CommonData/jdk/bin/jmc.ini: line 8: -XX:+UseG1GC: command not found
      /export/local/aurora/CommonData/jdk/bin/jmc.ini: line 9: -XX:+UnlockCommercialFeatures: command not found
      /export/local/aurora/CommonData/jdk/bin/jmc.ini: line 10: -XX:+FlightRecorder: command not found
      /export/local/aurora/CommonData/jdk/bin/jmc.ini: line 11: -Djava.net.preferIPv4Stack=true: command not found
      Error: /export/local/aurora/CommonData/jdk/bin/jmc.ini fails -J-fullversion comparison
      Expected:
      java full version "1.8.0-ea-b100"
      Actual:
      /export/local/aurora/CommonData/jdk/bin/jmc.ini: line 1: -startup: command not found
      /export/local/aurora/CommonData/jdk/bin/jmc.ini: line 2: ../lib/missioncontrol/plugins/org.eclipse.equinox.launcher_1.3.0.v20120522-1813.jar: No such file or directory
      /export/local/aurora/CommonData/jdk/bin/jmc.ini: line 3: --launcher.library: command not found
      /export/local/aurora/CommonData/jdk/bin/jmc.ini: line 4: ../lib/missioncontrol/plugins/org.eclipse.equinox.launcher.gtk.linux.x86_64_1.1.200.v20120913-144807: No such file or directory
      /export/local/aurora/CommonData/jdk/bin/jmc.ini: line 5: -vm: command not found
      /export/local/aurora/CommonData/jdk/bin/jmc.ini: line 6: ./java: No such file or directory
      /export/local/aurora/CommonData/jdk/bin/jmc.ini: line 7: -vmargs: command not found
      /export/local/aurora/CommonData/jdk/bin/jmc.ini: line 8: -XX:+UseG1GC: command not found
      /export/local/aurora/CommonData/jdk/bin/jmc.ini: line 9: -XX:+UnlockCommercialFeatures: command not found
      /export/local/aurora/CommonData/jdk/bin/jmc.ini: line 10: -XX:+FlightRecorder: command not found
      /export/local/aurora/CommonData/jdk/bin/jmc.ini: line 11: -Djava.net.preferIPv4Stack=true: command not found
      Testing (-J-version): /export/local/aurora/CommonData/jdk/bin/orbd
      Testing (-J-version): /export/local/aurora/CommonData/jdk/bin/jstatd
      Testing (-J-version): /export/local/aurora/CommonData/jdk/bin/wsgen
      Testing (-J-version): /export/local/aurora/CommonData/jdk/bin/jjs
      Testing (-J-version): /export/local/aurora/CommonData/jdk/bin/native2ascii
      Testing (-J-version): /export/local/aurora/CommonData/jdk/bin/jarsigner
      Testing (-J-version): /export/local/aurora/CommonData/jdk/bin/rmiregistry
      Testing (-J-version): /export/local/aurora/CommonData/jdk/bin/jcmd
      Testing (-J-version): /export/local/aurora/CommonData/jdk/bin/xjc
      Testing (-J-version): /export/local/aurora/CommonData/jdk/bin/javah
      Testing (-J-version): /export/local/aurora/CommonData/jdk/bin/pack200
      Testing (-J-version): /export/local/aurora/CommonData/jdk/bin/jstack
      Testing (-J-version): /export/local/aurora/CommonData/jdk/bin/javap
      Testing (-J-version): /export/local/aurora/CommonData/jdk/bin/jconsole
      Testing (-J-version): /export/local/aurora/CommonData/jdk/bin/rmid
      Testing (-J-version): /export/local/aurora/CommonData/jdk/bin/jar
      Testing (-J-version): /export/local/aurora/CommonData/jdk/bin/jhat
      Testing (-J-version): /export/local/aurora/CommonData/jdk/bin/appletviewer
      Testing (-J-version): /export/local/aurora/CommonData/jdk/bin/policytool
      Testing (-J-version): /export/local/aurora/CommonData/jdk/bin/serialver
      Testing (-J-version): /export/local/aurora/CommonData/jdk/bin/jrunscript
      Testing (-J-version): /export/local/aurora/CommonData/jdk/bin/tnameserv
      Testing (-J-version): /export/local/aurora/CommonData/jdk/bin/rmic
      Testing (-J-version): /export/local/aurora/CommonData/jdk/bin/jmap
      Version Test: 2
      ----------System.err:(13/702)----------
      java.lang.AssertionError: Some tests failed
      at VersionCheck.main(VersionCheck.java:222)
      at sun.reflect.NativeMethodAccessorImpl.invoke0(Native Method)
      at sun.reflect.NativeMethodAccessorImpl.invoke(NativeMethodAccessorImpl.java:57)
      at sun.reflect.DelegatingMethodAccessorImpl.invoke(DelegatingMethodAccessorImpl.java:43)
      at java.lang.reflect.Method.invoke(Method.java:491)
      at com.sun.javatest.regtest.MainWrapper$MainThread.run(MainWrapper.java:94)
      at java.lang.Thread.run(Thread.java:724)

      JavaTest Message: Test threw exception: java.lang.AssertionError: Some tests failed
      JavaTest Message: shutting down test

      STATUS:Failed.`main' threw exception: java.lang.AssertionError: Some tests failed
      result: Failed. Execution failed: `main' threw exception: java.lang.AssertionError: Some tests failed


      test result: Failed. Execution failed: `main' threw exception: java.lang.AssertionError: Some tests failed

        Attachments

          Issue Links

            Activity

              People

              • Assignee:
                Unassigned
                Reporter:
                asakharu Aleksandr Sakharuk (Inactive)
              • Votes:
                0 Vote for this issue
                Watchers:
                6 Start watching this issue

                Dates

                • Created:
                  Updated:
                  Resolved: