Uploaded image for project: 'JDK'
  1. JDK
  2. JDK-8027160

REGRESSION: test javax/swing/dnd/7171812/bug7171812.java fails since JDK 8 b110

    Details

    • Subcomponent:
    • Introduced In Build:
      b110
    • Introduced In Version:
      8
    • CPU:
      x86_64
    • OS:
      linux_oracle_6.0

      Description

      Testsuite name: Regression
      Test names: javax/swing/dnd/7171812/bug7171812.java
      JDK tested: JDK 8b112
      OS tested: Oracle Linux 6 RedHat kernel 64-bit.
      Is it a regression: YES
      Regression introduced in JDK 8 b110.

      Tests pass against JDK 8 b109, fails against JDK 8 b110.

      LOG:

      #section:main
      ----------messages:(3/107)----------
      command: main bug7171812
      reason: User specified action: run main bug7171812
      elapsed time (seconds): 7.251
      ----------System.out:(0/0)----------
      ----------System.err:(13/775)----------
      java.lang.RuntimeException: Test failed, scroll on drag doesn't work!
      at bug7171812.main(bug7171812.java:79)
      at sun.reflect.NativeMethodAccessorImpl.invoke0(Native Method)
      at sun.reflect.NativeMethodAccessorImpl.invoke(NativeMethodAccessorImpl.java:57)
      at sun.reflect.DelegatingMethodAccessorImpl.invoke(DelegatingMethodAccessorImpl.java:43)
      at java.lang.reflect.Method.invoke(Method.java:483)
      at com.sun.javatest.regtest.MainWrapper$MainThread.run(MainWrapper.java:94)
      at java.lang.Thread.run(Thread.java:724)

      JavaTest Message: Test threw exception: java.lang.RuntimeException: Test failed, scroll on drag doesn't work!
      JavaTest Message: shutting down test

      STATUS:Failed.`main' threw exception: java.lang.RuntimeException: Test failed, scroll on drag doesn't work!
      result: Failed. Execution failed: `main' threw exception: java.lang.RuntimeException: Test failed, scroll on drag doesn't work!


      test result: Failed. Execution failed: `main' threw exception: java.lang.RuntimeException: Test failed, scroll on drag doesn't work!

        Attachments

          Issue Links

            Activity

              People

              • Assignee:
                pchelko Petr Pchelko (Inactive)
                Reporter:
                kshefov Konstantin Shefov
              • Votes:
                0 Vote for this issue
                Watchers:
                3 Start watching this issue

                Dates

                • Created:
                  Updated:
                  Resolved: