Uploaded image for project: 'JDK'
  1. JDK
  2. JDK-8028000

java/awt/image/DrawImage/EABlitTest.java fails

    Details

    • Subcomponent:
      2d
    • CPU:
      sparc_64
    • OS:
      solaris_10

      Description

      fails on jdk1.8.0b113 and jdk1.8.0b112. Passes on jdk1.7.0_45b18

      java.lang.RuntimeException: Test FAILED!
      at EABlitTest.test(EABlitTest.java:63)
      at EABlitTest.main(EABlitTest.java:92)
      at sun.reflect.NativeMethodAccessorImpl.invoke0(Native Method)
      at sun.reflect.NativeMethodAccessorImpl.invoke(NativeMethodAccessorImpl.java:57)
      at sun.reflect.DelegatingMethodAccessorImpl.invoke(DelegatingMethodAccessorImpl.java:43)
      at java.lang.reflect.Method.invoke(Method.java:483)
      at com.sun.javatest.regtest.MainWrapper$MainThread.run(MainWrapper.java:94)
      at java.lang.Thread.run(Thread.java:744)

      JavaTest Message: Test threw exception: java.lang.RuntimeException: Test FAILED!
      JavaTest Message: shutting down test

      STATUS:Failed.`main' threw exception: java.lang.RuntimeException: Test FAILED!
      result: Failed. Execution failed: `main' threw exception: java.lang.RuntimeException: Test FAILED!


      test result: Failed. Execution failed: `main' threw exception: java.lang.RuntimeException: Test FAILED!

        Attachments

          Issue Links

            Activity

              People

              • Assignee:
                prr Philip Race
                Reporter:
                asakharu Aleksandr Sakharuk (Inactive)
              • Votes:
                0 Vote for this issue
                Watchers:
                6 Start watching this issue

                Dates

                • Created:
                  Updated: