Uploaded image for project: 'JDK'
  1. JDK
  2. JDK-8028117

closed/javax/swing/DataTransfer/DnDAutoTests/JTree/TreeGTKAutoTest_R.java fails

    Details

    • Type: Bug
    • Status: Open
    • Priority: P4
    • Resolution: Unresolved
    • Affects Version/s: 7, 8, 9, 10
    • Fix Version/s: tbd
    • Component/s: client-libs
    • Labels:
    • Subcomponent:
    • CPU:
      x86_64
    • OS:
      linux_ubuntu

      Description

      Fails on jdk1.8.0b114, jdk1.8.0b113, jdk1.7.0_45b18

      ----------System.out:(40/1594)----------

      *********************************************
      **************** TreeAutoTest ***************
      *********************************************


      *** Set of tests for LaF = GTK, RtL orientation = true *** <<<


      Transaction {
      ***
      *** Test 1/4: The USE_SELECTION mode
      ***
      STEP 1
      The following exception occured during normal transaction execution, so it will be tried one more time with more safe parameters:
      DnDTransactionException: Test failed: 'sports' != 'food'
      at TreeAutoTest$TreeAutoTestPanel.managedWaitCorrectSelection(TreeAutoTest.java:1108)
      at TreeAutoTest$TreeAutoTestPanel.impl_ON_AND_USE_SELECTION(TreeAutoTest.java:855)
      at TreeAutoTest$TreeAutoTestPanel.doRobotWork_USE_SELECTION_Test_1(TreeAutoTest.java:309)
      at TreeAutoTest$1.doExecute(TreeAutoTest.java:152)
      at DnDTest$DnDTransaction.execute(DnDTest.java:374)
      at DnDTest.runTrans(DnDTest.java:111)
      at TreeAutoTest.doTests(TreeAutoTest.java:149)
      at DnDTest.commentedDoTests(DnDTest.java:103)
      at DnDTest.execute(DnDTest.java:180)
      at TreeGTKAutoTest_R.main(TreeGTKAutoTest_R.java:14)
      at sun.reflect.NativeMethodAccessorImpl.invoke0(Native Method)
      at sun.reflect.NativeMethodAccessorImpl.invoke(NativeMethodAccessorImpl.java:57)
      at sun.reflect.DelegatingMethodAccessorImpl.invoke(DelegatingMethodAccessorImpl.java:43)
      at java.lang.reflect.Method.invoke(Method.java:483)
      at com.sun.javatest.regtest.MainWrapper$MainThread.run(MainWrapper.java:94)
      at java.lang.Thread.run(Thread.java:744)

      Restoring environment...
      Setting safe mode...
      Execution in the safe mode...
      ***
      *** Test 1/4: The USE_SELECTION mode
      ***
      STEP 1
      ----------System.err:(22/1289)----------
      DnDTransactionException: Test failed: 'sports' != 'food'
      at TreeAutoTest$TreeAutoTestPanel.managedWaitCorrectSelection(TreeAutoTest.java:1108)
      at TreeAutoTest$TreeAutoTestPanel.impl_ON_AND_USE_SELECTION(TreeAutoTest.java:855)
      at TreeAutoTest$TreeAutoTestPanel.doRobotWork_USE_SELECTION_Test_1(TreeAutoTest.java:309)
      at TreeAutoTest$1.doExecute(TreeAutoTest.java:152)
      at DnDTest$DnDTransaction.execute(DnDTest.java:398)
      at DnDTest.runTrans(DnDTest.java:111)
      at TreeAutoTest.doTests(TreeAutoTest.java:149)
      at DnDTest.commentedDoTests(DnDTest.java:103)
      at DnDTest.execute(DnDTest.java:180)
      at TreeGTKAutoTest_R.main(TreeGTKAutoTest_R.java:14)
      at sun.reflect.NativeMethodAccessorImpl.invoke0(Native Method)
      at sun.reflect.NativeMethodAccessorImpl.invoke(NativeMethodAccessorImpl.java:57)
      at sun.reflect.DelegatingMethodAccessorImpl.invoke(DelegatingMethodAccessorImpl.java:43)
      at java.lang.reflect.Method.invoke(Method.java:483)
      at com.sun.javatest.regtest.MainWrapper$MainThread.run(MainWrapper.java:94)
      at java.lang.Thread.run(Thread.java:744)

      JavaTest Message: Test threw exception: DnDTransactionException: Test failed: 'sports' != 'food'
      JavaTest Message: shutting down test

      STATUS:Failed.`main' threw exception: DnDTransactionException: Test failed: 'sports' != 'food'
      result: Failed. Execution failed: `main' threw exception: DnDTransactionException: Test failed: 'sports' != 'food'


      test result: Failed. Execution failed: `main' threw exception: DnDTransactionException: Test failed: 'sports' != 'food'

        Attachments

          Activity

            People

            • Assignee:
              Unassigned
              Reporter:
              asakharu Aleksandr Sakharuk (Inactive)
            • Votes:
              0 Vote for this issue
              Watchers:
              7 Start watching this issue

              Dates

              • Created:
                Updated: