Uploaded image for project: 'JDK'
  1. JDK
  2. JDK-8028125

[TEST_BUG] closed/javax/swing/KeyboardManager/4345798/bug4345798.java fails

    XMLWordPrintable

    Details

    • Subcomponent:
    • Introduced In Build:
      b114
    • CPU:
      x86_64
    • OS:
      linux_ubuntu

      Description

      fails on jdk1.8.0b114, passes on jdk1.8.0b113 and jdk1.7.0_45b18

      java.lang.RuntimeException: Test failed.
      at bug4345798.destroy(bug4345798.java:48)
      at com.sun.javatest.regtest.AppletWrapper$AppletRunnable.run(AppletWrapper.java:182)
      at java.lang.Thread.run(Thread.java:744)
      STATUS:Failed.Applet thread threw exception: java.lang.RuntimeException: Test failed.
      result: Failed. Execution failed: Applet thread threw exception: java.lang.RuntimeException: Test failed.


      test result: Failed. Execution failed: Applet thread threw exception: java.lang.RuntimeException: Test failed.

        Attachments

          Issue Links

            Activity

              People

              Assignee:
              serb Sergey Bylokhov
              Reporter:
              asakharu Aleksandr Sakharuk (Inactive)
              Votes:
              0 Vote for this issue
              Watchers:
              3 Start watching this issue

                Dates

                Created:
                Updated: