Uploaded image for project: 'JDK'
  1. JDK
  2. JDK-8028202

closed/sun/java2d/DirectX/GdiDDSyncTest/GdiDDSyncTest.java fails

    Details

    • Subcomponent:
      2d
    • CPU:
      x86_64
    • OS:
      linux_ubuntu

      Description

      fails on jdk1.8.0b114, jdk1.8.0b113, jdk1.7.0_45b18

      Test failed: found screen pixel at (0,0) ff999898, supposed to be ff000000
      java.lang.RuntimeException: Test failed
      at GdiDDSyncTest.test(GdiDDSyncTest.java:180)
      at GdiDDSyncTest.access$000(GdiDDSyncTest.java:37)
      at GdiDDSyncTest$1.actionPerformed(GdiDDSyncTest.java:51)
      at javax.swing.Timer.fireActionPerformed(Timer.java:313)
      at javax.swing.Timer$DoPostEvent.run(Timer.java:245)
      at java.awt.event.InvocationEvent.dispatch(InvocationEvent.java:251)
      at java.awt.EventQueue.dispatchEventImpl(EventQueue.java:744)
      at java.awt.EventQueue.access$400(EventQueue.java:97)
      at java.awt.EventQueue$3.run(EventQueue.java:697)
      at java.awt.EventQueue$3.run(EventQueue.java:691)
      at java.security.AccessController.doPrivileged(Native Method)
      at java.security.ProtectionDomain$1.doIntersectionPrivilege(ProtectionDomain.java:75)
      at java.awt.EventQueue.dispatchEvent(EventQueue.java:714)
      at java.awt.EventDispatchThread.pumpOneEventForFilters(EventDispatchThread.java:220)
      at java.awt.EventDispatchThread.pumpEventsForFilter(EventDispatchThread.java:135)
      at java.awt.EventDispatchThread.pumpEventsForHierarchy(EventDispatchThread.java:123)
      at java.awt.EventDispatchThread.pumpEvents(EventDispatchThread.java:119)
      at java.awt.EventDispatchThread.pumpEvents(EventDispatchThread.java:111)
      at java.awt.EventDispatchThread.run(EventDispatchThread.java:97)
      STATUS:Failed.`main' threw exception: java.lang.RuntimeException: Test failed
      result: Failed. Execution failed: `main' threw exception: java.lang.RuntimeException: Test failed


      test result: Failed. Execution failed: `main' threw exception: java.lang.RuntimeException: Test failed

        Attachments

          Activity

            People

            • Assignee:
              serb Sergey Bylokhov
              Reporter:
              asakharu Aleksandr Sakharuk (Inactive)
            • Votes:
              0 Vote for this issue
              Watchers:
              9 Start watching this issue

              Dates

              • Created:
                Updated: