Uploaded image for project: 'JDK'
  1. JDK
  2. JDK-8028204

closed/sun/java2d/SunGraphics2D/CoordinateTruncationBug.java

    Details

    • Type: Bug
    • Status: Closed
    • Priority: P3
    • Resolution: Cannot Reproduce
    • Affects Version/s: 8
    • Fix Version/s: 8
    • Component/s: client-libs
    • Labels:
    • Subcomponent:
      2d
    • CPU:
      x86_64
    • OS:
      linux_ubuntu

      Description

      fails with jdk1.8.0b114, jdk1.8.0b113, jdk1.7.0_45b18

      Screen(0, 0) == ffdfdfdf
      Screen failed!
      java.lang.RuntimeException: Test failed due to 1 or more failures
      at CoordinateTruncationBug.main(CoordinateTruncationBug.java:39)
      at sun.reflect.NativeMethodAccessorImpl.invoke0(Native Method)
      at sun.reflect.NativeMethodAccessorImpl.invoke(NativeMethodAccessorImpl.java:57)
      at sun.reflect.DelegatingMethodAccessorImpl.invoke(DelegatingMethodAccessorImpl.java:43)
      at java.lang.reflect.Method.invoke(Method.java:483)
      at com.sun.javatest.regtest.MainWrapper$MainThread.run(MainWrapper.java:94)
      at java.lang.Thread.run(Thread.java:744)

      JavaTest Message: Test threw exception: java.lang.RuntimeException: Test failed due to 1 or more failures
      JavaTest Message: shutting down test

      STATUS:Failed.`main' threw exception: java.lang.RuntimeException: Test failed due to 1 or more failures
      result: Failed. Execution failed: `main' threw exception: java.lang.RuntimeException: Test failed due to 1 or more failures


      test result: Failed. Execution failed: `main' threw exception: java.lang.RuntimeException: Test failed due to 1 or more failures

        Attachments

          Activity

            People

            • Assignee:
              prr Philip Race
              Reporter:
              asakharu Aleksandr Sakharuk (Inactive)
            • Votes:
              0 Vote for this issue
              Watchers:
              3 Start watching this issue

              Dates

              • Created:
                Updated:
                Resolved: