Uploaded image for project: 'JDK'
  1. JDK
  2. JDK-8028281

[TEST_BUG] [macosx] javax/swing/JTabbedPane/7024235/Test7024235.java fails

    Details

      Description

      Fails on 1.8.0b115, 1.8.0b114 with log

      ----------System.out:(0/0)----------
      ----------System.err:(35/2240)----------
      2013-11-10 03:39:12.801 java[53332:507] ApplePersistenceIgnoreState: Existing state will not be touched. New state will be written to /var/folders/1n/2sd5m7tj7cx_wpvl_jc55lhr001wjw/T/net.java.openjdk.cmd.savedState
      java.lang.reflect.InvocationTargetException
      at java.awt.EventQueue.invokeAndWait(EventQueue.java:1300)
      at java.awt.EventQueue.invokeAndWait(EventQueue.java:1275)
      at javax.swing.SwingUtilities.invokeAndWait(SwingUtilities.java:1350)
      at Test7024235.test(Test7024235.java:91)
      at Test7024235.main(Test7024235.java:57)
      at sun.reflect.NativeMethodAccessorImpl.invoke0(Native Method)
      at sun.reflect.NativeMethodAccessorImpl.invoke(NativeMethodAccessorImpl.java:57)
      at sun.reflect.DelegatingMethodAccessorImpl.invoke(DelegatingMethodAccessorImpl.java:43)
      at java.lang.reflect.Method.invoke(Method.java:483)
      at com.sun.javatest.regtest.MainWrapper$MainThread.run(MainWrapper.java:94)
      at java.lang.Thread.run(Thread.java:744)
      Caused by: java.lang.NullPointerException
      at Test7024235.test(Test7024235.java:101)
      at Test7024235.run(Test7024235.java:79)
      at java.awt.event.InvocationEvent.dispatch(InvocationEvent.java:301)
      at java.awt.EventQueue.dispatchEventImpl(EventQueue.java:744)
      at java.awt.EventQueue.access$400(EventQueue.java:97)
      at java.awt.EventQueue$3.run(EventQueue.java:697)
      at java.awt.EventQueue$3.run(EventQueue.java:691)
      at java.security.AccessController.doPrivileged(Native Method)
      at java.security.ProtectionDomain$1.doIntersectionPrivilege(ProtectionDomain.java:75)
      at java.awt.EventQueue.dispatchEvent(EventQueue.java:714)
      at java.awt.EventDispatchThread.pumpOneEventForFilters(EventDispatchThread.java:201)
      at java.awt.EventDispatchThread.pumpEventsForFilter(EventDispatchThread.java:116)
      at java.awt.EventDispatchThread.pumpEventsForHierarchy(EventDispatchThread.java:105)
      at java.awt.EventDispatchThread.pumpEvents(EventDispatchThread.java:101)
      at java.awt.EventDispatchThread.pumpEvents(EventDispatchThread.java:93)
      at java.awt.EventDispatchThread.run(EventDispatchThread.java:82)

      JavaTest Message: Test threw exception: java.lang.reflect.InvocationTargetException
      JavaTest Message: shutting down test

      STATUS:Failed.`main' threw exception: java.lang.reflect.InvocationTargetException
      result: Failed. Execution failed: `main' threw exception: java.lang.reflect.InvocationTargetException


      test result: Failed. Execution failed: `main' threw exception: java.lang.reflect.InvocationTargetException

      on jdk1.7.0_45b18 with another log

      ----------System.out:(5/128)----------
      name = Nimbus
      step = first
      index = 2
      bounds = java.awt.Rectangle[x=25,y=63,width=-7,height=22]
      indexAtLocation(22,22) returns 1
      ----------System.err:(14/696)----------
      java.lang.Error: TEST FAILED
      at Test7024235.test(Test7024235.java:93)
      at Test7024235.main(Test7024235.java:57)
      at sun.reflect.NativeMethodAccessorImpl.invoke0(Native Method)
      at sun.reflect.NativeMethodAccessorImpl.invoke(NativeMethodAccessorImpl.java:57)
      at sun.reflect.DelegatingMethodAccessorImpl.invoke(DelegatingMethodAccessorImpl.java:43)
      at java.lang.reflect.Method.invoke(Method.java:606)
      at com.sun.javatest.regtest.MainWrapper$MainThread.run(MainWrapper.java:94)
      at java.lang.Thread.run(Thread.java:744)

      JavaTest Message: Test threw exception: java.lang.Error: TEST FAILED
      JavaTest Message: shutting down test

      STATUS:Failed.`main' threw exception: java.lang.Error: TEST FAILED
      result: Failed. Execution failed: `main' threw exception: java.lang.Error: TEST FAILED


      test result: Failed. Execution failed: `main' threw exception: java.lang.Error: TEST FAILED

        Attachments

          Activity

            People

            • Assignee:
              serb Sergey Bylokhov
              Reporter:
              asakharu Aleksandr Sakharuk (Inactive)
            • Votes:
              0 Vote for this issue
              Watchers:
              4 Start watching this issue

              Dates

              • Created:
                Updated: