Uploaded image for project: 'JDK'
  1. JDK
  2. JDK-8028484

[TEST_BUG][macosx] closed/java/awt/MouseInfo/JContainerMousePositionTest fails

    Details

    • Subcomponent:
    • Introduced In Build:
      b110
    • OS:
      os_x

      Backports

        Description

        fails with jdk1.8.0b115, jdk1.8.0b114. Passes on jdk.1.7.0_45b18

        ----------System.out:(4/370)----------
        Any messages for the tester will display here.
        Test stage completed: Container.getMousePosition(false) returned null result over child Component. Passed.
        Test stage compelted: Container.getMousePosition(true) returned non-null result over child Component. Passed.
        Test stage completed: Container.getMousePosition(boolean) returned null result outside Container. Passed.
        ----------System.err:(5/481)----------
        java.lang.RuntimeException: Test failed: Container.getMousePosition(boolean) returned null result inside Container.
        at JContainerMousePositionTest.start(JContainerMousePositionTest.java:118)
        at com.sun.javatest.regtest.AppletWrapper$AppletRunnable.run(AppletWrapper.java:158)
        at java.lang.Thread.run(Thread.java:744)
        STATUS:Failed.Applet thread threw exception: java.lang.RuntimeException: Test failed: Container.getMousePosition(boolean) returned null result inside Container.
        result: Failed. Execution failed: Applet thread threw exception: java.lang.RuntimeException: Test failed: Container.getMousePosition(boolean) returned null result inside Container.


        test result: Failed. Execution failed: Applet thread threw exception: java.lang.RuntimeException: Test failed: Container.getMousePosition(boolean) returned null result inside Container.

          Attachments

            Issue Links

              Activity

                People

                • Assignee:
                  pchelko Petr Pchelko (Inactive)
                  Reporter:
                  asakharu Aleksandr Sakharuk (Inactive)
                • Votes:
                  0 Vote for this issue
                  Watchers:
                  6 Start watching this issue

                  Dates

                  • Created:
                    Updated:
                    Resolved: