Uploaded image for project: 'JDK'
  1. JDK
  2. JDK-8028701

java/awt/Focus/ShowFrameCheckForegroundTest/ShowFrameCheckForegroundTest.java fails

    Details

    • Subcomponent:
    • Understanding:
      Cause Known
    • CPU:
      generic
    • OS:
      generic

      Description

      fails on azure with jdk1.8.0b116, jdk1.8.0b115 andjdk1.7.0_45b18

      ----------System.out:(3/368)----------
      Stage 1. Toplevel java.awt.Frame[frame0,200,0,140x62,layout=java.awt.BorderLayout,title=Frame,resizable,normal] - passed
      Stage 1. Toplevel java.awt.Dialog[dialog0,200,0,140x62,layout=java.awt.BorderLayout,MODELESS,title=Owned Dialog] - passed
      Stage 1. Toplevel java.awt.Dialog[dialog1,200,0,140x62,layout=java.awt.BorderLayout,MODELESS,title=Owned Dialog] - passed
      ----------System.err:(15/1343)----------
      TestFailedException: Test failed: Stage 2. The toplevel java.awt.Frame[frame0,200,0,140x62,hidden,layout=java.awt.BorderLayout,title=Frame,resizable,normal] wasn't made foreground on showing
      at ShowFrameCheckForegroundTest.test(ShowFrameCheckForegroundTest.java:113)
      at ShowFrameCheckForegroundTest.start(ShowFrameCheckForegroundTest.java:89)
      at ShowFrameCheckForegroundTest.main(ShowFrameCheckForegroundTest.java:62)
      at sun.reflect.NativeMethodAccessorImpl.invoke0(Native Method)
      at sun.reflect.NativeMethodAccessorImpl.invoke(NativeMethodAccessorImpl.java:57)
      at sun.reflect.DelegatingMethodAccessorImpl.invoke(DelegatingMethodAccessorImpl.java:43)
      at java.lang.reflect.Method.invoke(Method.java:483)
      at com.sun.javatest.regtest.MainWrapper$MainThread.run(MainWrapper.java:94)
      at java.lang.Thread.run(Thread.java:744)

      JavaTest Message: Test threw exception: TestFailedException: Test failed: Stage 2. The toplevel java.awt.Frame[frame0,200,0,140x62,hidden,layout=java.awt.BorderLayout,title=Frame,resizable,normal] wasn't made foreground on showing
      JavaTest Message: shutting down test

      STATUS:Failed.`main' threw exception: TestFailedException: Test failed: Stage 2. The toplevel java.awt.Frame[frame0,200,0,140x62,hidden,layout=java.awt.BorderLayout,title=Frame,resizable,normal] wasn't made foreground on showing
      result: Failed. Execution failed: `main' threw exception: TestFailedException: Test failed: Stage 2. The toplevel java.awt.Frame[frame0,200,0,140x62,hidden,layout=java.awt.BorderLayout,title=Frame,resizable,normal] wasn't made foreground on showing


      test result: Failed. Execution failed: `main' threw exception: TestFailedException: Test failed: Stage 2. The toplevel java.awt.Frame[frame0,200,0,140x62,hidden,layout=java.awt.BorderLayout,title=Frame,resizable,normal] wasn't made foreground on showing

        Attachments

          Activity

            People

            • Assignee:
              jdv Jayathirth D V
              Reporter:
              asakharu Aleksandr Sakharuk (Inactive)
            • Votes:
              0 Vote for this issue
              Watchers:
              8 Start watching this issue

              Dates

              • Created:
                Updated: