Uploaded image for project: 'JDK'
  1. JDK
  2. JDK-8029022

[TEST_BUG] closed/java/awt/datatransfer/ClipboardPerformanceTest/ClipboardPerformanceTest fails

    Details

    • Subcomponent:
    • CPU:
      x86_64
    • OS:
      windows_7

      Description

      fails with jdk1.8.0b117, jdk1.8.0b116. Passes with jdk1.7.0_45b18

      ----------System.out:(0/0)----------
      ----------System.err:(12/514)----------
      ========= Child VM System.err ========
      Size: 66668
      Time consumed: 25
      Old algorithm: 188
      Ratio: 7.0
      ======================================
      Child VM: abnormal termination
      java.lang.RuntimeException: The test failed.
      at ClipboardPerformanceTest.start(ClipboardPerformanceTest.java:186)
      at com.sun.javatest.regtest.AppletWrapper$AppletRunnable.run(AppletWrapper.java:158)
      at java.lang.Thread.run(Thread.java:744)
      STATUS:Failed.Applet thread threw exception: java.lang.RuntimeException: The test failed.
      result: Failed. Execution failed: Applet thread threw exception: java.lang.RuntimeException: The test failed.


      test result: Failed. Execution failed: Applet thread threw exception: java.lang.RuntimeException: The test failed.

        Attachments

          Activity

            People

            • Assignee:
              Unassigned
              Reporter:
              asakharu Aleksandr Sakharuk (Inactive)
            • Votes:
              0 Vote for this issue
              Watchers:
              6 Start watching this issue

              Dates

              • Created:
                Updated: