Uploaded image for project: 'JDK'
  1. JDK
  2. JDK-8029678

java/awt/datatransfer/DragUnicodeBetweenJVMTest/DragUnicodeBetweenJVMTest fails

    Details

    • Type: Bug
    • Status: Closed
    • Priority: P4
    • Resolution: Not an Issue
    • Affects Version/s: 8
    • Fix Version/s: None
    • Component/s: client-libs
    • Labels:

      Description

      fails on jdk1.8.0b117, jdk1.8.0b116,jdk1.7.0_45b18

      ----------System.out:(0/0)----------
      ----------System.err:(12/1137)*----------
      C:\\sakharuk\\1.8.0b117\\j2se\\test\\java\\awt\\datatransfer\\DragUnicodeBetweenJVMTest\\DragUnicodeBetweenJVMTest.java:51: error: package test.java.awt.regtesthelpers.process does not exist
      import test.java.awt.regtesthelpers.process.ProcessCommunicator;
                                                 ^
      C:\\sakharuk\\1.8.0b117\\j2se\\test\\java\\awt\\datatransfer\\DragUnicodeBetweenJVMTest\\DragUnicodeBetweenJVMTest.java:52: error: package test.java.awt.regtesthelpers.process does not exist
      import test.java.awt.regtesthelpers.process.ProcessResults;
                                                 ^
      C:\\sakharuk\\1.8.0b117\\j2se\\test\\java\\awt\\datatransfer\\DragUnicodeBetweenJVMTest\\DragUnicodeBetweenJVMTest.java:108: error: cannot access ProcessResults
          private static void verifyTestResults(ProcessResults processResults) {
                                                ^
        bad source file: C:\\sakharuk\\1.8.0b117\\j2se\\test\\java\\awt\\regtesthelpers\\process\\ProcessResults.java
          file does not contain class ProcessResults
          Please remove or make sure it appears in the correct subdirectory of the sourcepath.
      result: Failed. Compilation failed: Compilation failed


      test result: Failed. Compilation failed: Compilation failed

        Attachments

          Activity

            People

            • Assignee:
              pchelko Petr Pchelko (Inactive)
              Reporter:
              asakharu Aleksandr Sakharuk (Inactive)
            • Votes:
              0 Vote for this issue
              Watchers:
              3 Start watching this issue

              Dates

              • Created:
                Updated:
                Resolved: