Uploaded image for project: 'JDK'
  1. JDK
  2. JDK-8029816

jdk/lambda/vm/DefaultMethodsTest.java fails with openjdk

    Details

      Description

      fails with openjdk1.8.0 b112, b118, b119

      ----------System.out:(314/21052)----------
      [TestNG] Running:
        jdk/lambda/vm/DefaultMethodsTest.java

      test public void vm.DefaultMethodsTest.testAmbiguousReabstract(): failure
      java.lang.AssertionError: expected [class java.lang.AbstractMethodError] but found [class java.lang.IncompatibleClassChangeError]
      at org.testng.Assert.fail(Assert.java:89)
      at org.testng.Assert.failNotEquals(Assert.java:489)
      at org.testng.Assert.assertEquals(Assert.java:118)
      at org.testng.Assert.assertEquals(Assert.java:160)
      at separate.TestHarness.assertThrows(TestHarness.java:302)
      at separate.TestHarness.assertThrows(TestHarness.java:312)
      at vm.DefaultMethodsTest.testAmbiguousReabstract(DefaultMethodsTest.java:279)
      at sun.reflect.NativeMethodAccessorImpl.invoke0(Native Method)
      at sun.reflect.NativeMethodAccessorImpl.invoke(NativeMethodAccessorImpl.java:57)
      at sun.reflect.DelegatingMethodAccessorImpl.invoke(DelegatingMethodAccessorImpl.java:43)
      at java.lang.reflect.Method.invoke(Method.java:483)
      at org.testng.internal.MethodInvocationHelper.invokeMethod(MethodInvocationHelper.java:80)
      at org.testng.internal.Invoker.invokeMethod(Invoker.java:715)
      at org.testng.internal.Invoker.invokeTestMethod(Invoker.java:907)
      at org.testng.internal.Invoker.invokeTestMethods(Invoker.java:1237)
      at org.testng.internal.TestMethodWorker.invokeTestMethods(TestMethodWorker.java:127)
      at org.testng.internal.TestMethodWorker.run(TestMethodWorker.java:111)
      at org.testng.TestRunner.privateRun(TestRunner.java:767)
      at org.testng.TestRunner.run(TestRunner.java:617)
      at org.testng.SuiteRunner.runTest(SuiteRunner.java:334)
      at org.testng.SuiteRunner.runSequentially(SuiteRunner.java:329)
      at org.testng.SuiteRunner.privateRun(SuiteRunner.java:291)
      at org.testng.SuiteRunner.run(SuiteRunner.java:240)
      at org.testng.SuiteRunnerWorker.runSuite(SuiteRunnerWorker.java:51)
      at org.testng.SuiteRunnerWorker.run(SuiteRunnerWorker.java:85)
      at org.testng.TestNG.runSuitesSequentially(TestNG.java:1197)
      at org.testng.TestNG.runSuitesLocally(TestNG.java:1122)
      at org.testng.TestNG.run(TestNG.java:1030)
      at com.sun.javatest.regtest.TestNGAction$TestNGRunner.main(TestNGAction.java:155)
      at com.sun.javatest.regtest.TestNGAction$TestNGRunner.main(TestNGAction.java:139)
      at sun.reflect.NativeMethodAccessorImpl.invoke0(Native Method)
      at sun.reflect.NativeMethodAccessorImpl.invoke(NativeMethodAccessorImpl.java:57)
      at sun.reflect.DelegatingMethodAccessorImpl.invoke(DelegatingMethodAccessorImpl.java:43)
      at java.lang.reflect.Method.invoke(Method.java:483)
      at com.sun.javatest.regtest.MainWrapper$MainThread.run(MainWrapper.java:94)
      at java.lang.Thread.run(Thread.java:724)
      Test DefaultMethodsTest.testAmbiguousReabstract FAILED
      config public void separate.TestHarness.printError(org.testng.ITestResult): success
      config public void separate.TestHarness.reset(): success
      test public void vm.DefaultMethodsTest.testBasicDefault(): success
      config public void separate.TestHarness.printError(org.testng.ITestResult): success
      config public void separate.TestHarness.reset(): success
      test public void vm.DefaultMethodsTest.testConflict(): failure
      java.lang.AssertionError: expected [class java.lang.AbstractMethodError] but found [class java.lang.IncompatibleClassChangeError]
      at org.testng.Assert.fail(Assert.java:89)
      at org.testng.Assert.failNotEquals(Assert.java:489)
      at org.testng.Assert.assertEquals(Assert.java:118)
      at org.testng.Assert.assertEquals(Assert.java:160)
      at separate.TestHarness.assertThrows(TestHarness.java:302)
      at separate.TestHarness.assertThrows(TestHarness.java:312)
      at vm.DefaultMethodsTest.testConflict(DefaultMethodsTest.java:264)
      at sun.reflect.NativeMethodAccessorImpl.invoke0(Native Method)
      at sun.reflect.NativeMethodAccessorImpl.invoke(NativeMethodAccessorImpl.java:57)
      at sun.reflect.DelegatingMethodAccessorImpl.invoke(DelegatingMethodAccessorImpl.java:43)
      at java.lang.reflect.Method.invoke(Method.java:483)
      at org.testng.internal.MethodInvocationHelper.invokeMethod(MethodInvocationHelper.java:80)
      at org.testng.internal.Invoker.invokeMethod(Invoker.java:715)
      at org.testng.internal.Invoker.invokeTestMethod(Invoker.java:907)
      at org.testng.internal.Invoker.invokeTestMethods(Invoker.java:1237)
      at org.testng.internal.TestMethodWorker.invokeTestMethods(TestMethodWorker.java:127)
      at org.testng.internal.TestMethodWorker.run(TestMethodWorker.java:111)
      at org.testng.TestRunner.privateRun(TestRunner.java:767)
      at org.testng.TestRunner.run(TestRunner.java:617)
      at org.testng.SuiteRunner.runTest(SuiteRunner.java:334)
      at org.testng.SuiteRunner.runSequentially(SuiteRunner.java:329)
      at org.testng.SuiteRunner.privateRun(SuiteRunner.java:291)
      at org.testng.SuiteRunner.run(SuiteRunner.java:240)
      at org.testng.SuiteRunnerWorker.runSuite(SuiteRunnerWorker.java:51)
      at org.testng.SuiteRunnerWorker.run(SuiteRunnerWorker.java:85)
      at org.testng.TestNG.runSuitesSequentially(TestNG.java:1197)
      at org.testng.TestNG.runSuitesLocally(TestNG.java:1122)
      at org.testng.TestNG.run(TestNG.java:1030)
      at com.sun.javatest.regtest.TestNGAction$TestNGRunner.main(TestNGAction.java:155)
      at com.sun.javatest.regtest.TestNGAction$TestNGRunner.main(TestNGAction.java:139)
      at sun.reflect.NativeMethodAccessorImpl.invoke0(Native Method)
      at sun.reflect.NativeMethodAccessorImpl.invoke(NativeMethodAccessorImpl.java:57)
      at sun.reflect.DelegatingMethodAccessorImpl.invoke(DelegatingMethodAccessorImpl.java:43)
      at java.lang.reflect.Method.invoke(Method.java:483)
      at com.sun.javatest.regtest.MainWrapper$MainThread.run(MainWrapper.java:94)
      at java.lang.Thread.run(Thread.java:724)
      Test DefaultMethodsTest.testConflict FAILED
      config public void separate.TestHarness.printError(org.testng.ITestResult): success
      config public void separate.TestHarness.reset(): success
      test public void vm.DefaultMethodsTest.testDiamond(): success
      config public void separate.TestHarness.printError(org.testng.ITestResult): success
      config public void separate.TestHarness.reset(): success
      test public void vm.DefaultMethodsTest.testDisqualified(): success
      config public void separate.TestHarness.printError(org.testng.ITestResult): success
      config public void separate.TestHarness.reset(): success
      test public void vm.DefaultMethodsTest.testExisting(): success
      config public void separate.TestHarness.printError(org.testng.ITestResult): success
      config public void separate.TestHarness.reset(): success
      test public void vm.DefaultMethodsTest.testExistingInherited(): success
      config public void separate.TestHarness.printError(org.testng.ITestResult): success
      config public void separate.TestHarness.reset(): success
      test public void vm.DefaultMethodsTest.testExistingInheritedPlusDefault(): success
      config public void separate.TestHarness.printError(org.testng.ITestResult): success
      config public void separate.TestHarness.reset(): success
      test public void vm.DefaultMethodsTest.testExpandedDiamond(): success
      config public void separate.TestHarness.printError(org.testng.ITestResult): success
      config public void separate.TestHarness.reset(): success
      test public void vm.DefaultMethodsTest.testFarDefault(): success
      config public void separate.TestHarness.printError(org.testng.ITestResult): success
      config public void separate.TestHarness.reset(): success
      test public void vm.DefaultMethodsTest.testHarnessInvokeInterface(): success
      config public void separate.TestHarness.printError(org.testng.ITestResult): success
      config public void separate.TestHarness.reset(): success
      test public void vm.DefaultMethodsTest.testHarnessInvokeVirtual(): success
      config public void separate.TestHarness.printError(org.testng.ITestResult): success
      config public void separate.TestHarness.reset(): success
      test public void vm.DefaultMethodsTest.testHarnessThrows(): success
      config public void separate.TestHarness.printError(org.testng.ITestResult): success
      config public void separate.TestHarness.reset(): success
      test public void vm.DefaultMethodsTest.testInherited(): success
      config public void separate.TestHarness.printError(org.testng.ITestResult): success
      config public void separate.TestHarness.reset(): success
      test public void vm.DefaultMethodsTest.testInheritedWithConcrete(): success
      config public void separate.TestHarness.printError(org.testng.ITestResult): success
      config public void separate.TestHarness.reset(): success
      test public void vm.DefaultMethodsTest.testInheritedWithConcreteAndImpl(): success
      config public void separate.TestHarness.printError(org.testng.ITestResult): success
      config public void separate.TestHarness.reset(): success
      test public void vm.DefaultMethodsTest.testNoCovarNoBridge(): success
      config public void separate.TestHarness.printError(org.testng.ITestResult): success
      config public void separate.TestHarness.reset(): success
      test public void vm.DefaultMethodsTest.testNoNewMiranda(): success
      config public void separate.TestHarness.printError(org.testng.ITestResult): success
      config public void separate.TestHarness.reset(): success
      test public void vm.DefaultMethodsTest.testOverrideAbstract(): success
      config public void separate.TestHarness.printError(org.testng.ITestResult): success
      config public void separate.TestHarness.reset(): success
      test public void vm.DefaultMethodsTest.testReabstract(): success
      config public void separate.TestHarness.printError(org.testng.ITestResult): success
      config public void separate.TestHarness.reset(): success
      test public void vm.DefaultMethodsTest.testReflectCall(): success
      config public void separate.TestHarness.printError(org.testng.ITestResult): success
      config public void separate.TestHarness.reset(): success
      test public void vm.DefaultMethodsTest.testShadow(): success
      config public void separate.TestHarness.printError(org.testng.ITestResult): success
      config public void separate.TestHarness.reset(): success
      test public void vm.DefaultMethodsTest.testStrictfpDefault(): success
      config public void separate.TestHarness.printError(org.testng.ITestResult): success
      config public void separate.TestHarness.reset(): success
      test public void vm.DefaultMethodsTest.testSuperBasic(): success
      config public void separate.TestHarness.printError(org.testng.ITestResult): success
      config public void separate.TestHarness.reset(): success
      test public void vm.DefaultMethodsTest.testSuperConflict(): failure
      java.lang.AssertionError: Exception should have been thrown
      at org.testng.Assert.fail(Assert.java:89)
      at separate.TestHarness.assertThrows(TestHarness.java:297)
      at separate.TestHarness.assertThrows(TestHarness.java:312)
      at vm.DefaultMethodsTest.testSuperConflict(DefaultMethodsTest.java:487)
      at sun.reflect.NativeMethodAccessorImpl.invoke0(Native Method)
      at sun.reflect.NativeMethodAccessorImpl.invoke(NativeMethodAccessorImpl.java:57)
      at sun.reflect.DelegatingMethodAccessorImpl.invoke(DelegatingMethodAccessorImpl.java:43)
      at java.lang.reflect.Method.invoke(Method.java:483)
      at org.testng.internal.MethodInvocationHelper.invokeMethod(MethodInvocationHelper.java:80)
      at org.testng.internal.Invoker.invokeMethod(Invoker.java:715)
      at org.testng.internal.Invoker.invokeTestMethod(Invoker.java:907)
      at org.testng.internal.Invoker.invokeTestMethods(Invoker.java:1237)
      at org.testng.internal.TestMethodWorker.invokeTestMethods(TestMethodWorker.java:127)
      at org.testng.internal.TestMethodWorker.run(TestMethodWorker.java:111)
      at org.testng.TestRunner.privateRun(TestRunner.java:767)
      at org.testng.TestRunner.run(TestRunner.java:617)
      at org.testng.SuiteRunner.runTest(SuiteRunner.java:334)
      at org.testng.SuiteRunner.runSequentially(SuiteRunner.java:329)
      at org.testng.SuiteRunner.privateRun(SuiteRunner.java:291)
      at org.testng.SuiteRunner.run(SuiteRunner.java:240)
      at org.testng.SuiteRunnerWorker.runSuite(SuiteRunnerWorker.java:51)
      at org.testng.SuiteRunnerWorker.run(SuiteRunnerWorker.java:85)
      at org.testng.TestNG.runSuitesSequentially(TestNG.java:1197)
      at org.testng.TestNG.runSuitesLocally(TestNG.java:1122)
      at org.testng.TestNG.run(TestNG.java:1030)
      at com.sun.javatest.regtest.TestNGAction$TestNGRunner.main(TestNGAction.java:155)
      at com.sun.javatest.regtest.TestNGAction$TestNGRunner.main(TestNGAction.java:139)
      at sun.reflect.NativeMethodAccessorImpl.invoke0(Native Method)
      at sun.reflect.NativeMethodAccessorImpl.invoke(NativeMethodAccessorImpl.java:57)
      at sun.reflect.DelegatingMethodAccessorImpl.invoke(DelegatingMethodAccessorImpl.java:43)
      at java.lang.reflect.Method.invoke(Method.java:483)
      at com.sun.javatest.regtest.MainWrapper$MainThread.run(MainWrapper.java:94)
      at java.lang.Thread.run(Thread.java:724)
      Test DefaultMethodsTest.testSuperConflict FAILED
      config public void separate.TestHarness.printError(org.testng.ITestResult): success
      config public void separate.TestHarness.reset(): success
      test public void vm.DefaultMethodsTest.testSuperDisqual(): failure
      java.lang.AssertionError: Exception should have been thrown
      at org.testng.Assert.fail(Assert.java:89)
      at separate.TestHarness.assertThrows(TestHarness.java:297)
      at separate.TestHarness.assertThrows(TestHarness.java:312)
      at vm.DefaultMethodsTest.testSuperDisqual(DefaultMethodsTest.java:506)
      at sun.reflect.NativeMethodAccessorImpl.invoke0(Native Method)
      at sun.reflect.NativeMethodAccessorImpl.invoke(NativeMethodAccessorImpl.java:57)
      at sun.reflect.DelegatingMethodAccessorImpl.invoke(DelegatingMethodAccessorImpl.java:43)
      at java.lang.reflect.Method.invoke(Method.java:483)
      at org.testng.internal.MethodInvocationHelper.invokeMethod(MethodInvocationHelper.java:80)
      at org.testng.internal.Invoker.invokeMethod(Invoker.java:715)
      at org.testng.internal.Invoker.invokeTestMethod(Invoker.java:907)
      at org.testng.internal.Invoker.invokeTestMethods(Invoker.java:1237)
      at org.testng.internal.TestMethodWorker.invokeTestMethods(TestMethodWorker.java:127)
      at org.testng.internal.TestMethodWorker.run(TestMethodWorker.java:111)
      at org.testng.TestRunner.privateRun(TestRunner.java:767)
      at org.testng.TestRunner.run(TestRunner.java:617)
      at org.testng.SuiteRunner.runTest(SuiteRunner.java:334)
      at org.testng.SuiteRunner.runSequentially(SuiteRunner.java:329)
      at org.testng.SuiteRunner.privateRun(SuiteRunner.java:291)
      at org.testng.SuiteRunner.run(SuiteRunner.java:240)
      at org.testng.SuiteRunnerWorker.runSuite(SuiteRunnerWorker.java:51)
      at org.testng.SuiteRunnerWorker.run(SuiteRunnerWorker.java:85)
      at org.testng.TestNG.runSuitesSequentially(TestNG.java:1197)
      at org.testng.TestNG.runSuitesLocally(TestNG.java:1122)
      at org.testng.TestNG.run(TestNG.java:1030)
      at com.sun.javatest.regtest.TestNGAction$TestNGRunner.main(TestNGAction.java:155)
      at com.sun.javatest.regtest.TestNGAction$TestNGRunner.main(TestNGAction.java:139)
      at sun.reflect.NativeMethodAccessorImpl.invoke0(Native Method)
      at sun.reflect.NativeMethodAccessorImpl.invoke(NativeMethodAccessorImpl.java:57)
      at sun.reflect.DelegatingMethodAccessorImpl.invoke(DelegatingMethodAccessorImpl.java:43)
      at java.lang.reflect.Method.invoke(Method.java:483)
      at com.sun.javatest.regtest.MainWrapper$MainThread.run(MainWrapper.java:94)
      at java.lang.Thread.run(Thread.java:724)
      Test DefaultMethodsTest.testSuperDisqual FAILED
      config public void separate.TestHarness.printError(org.testng.ITestResult): success
      config public void separate.TestHarness.reset(): success
      test public void vm.DefaultMethodsTest.testSuperGeneric(): success
      config public void separate.TestHarness.printError(org.testng.ITestResult): success
      config public void separate.TestHarness.reset(): success
      test public void vm.DefaultMethodsTest.testSuperGenericDisqual(): failure
      java.lang.AssertionError: Exception should have been thrown
      at org.testng.Assert.fail(Assert.java:89)
      at separate.TestHarness.assertThrows(TestHarness.java:297)
      at vm.DefaultMethodsTest.testSuperGenericDisqual(DefaultMethodsTest.java:577)
      at sun.reflect.NativeMethodAccessorImpl.invoke0(Native Method)
      at sun.reflect.NativeMethodAccessorImpl.invoke(NativeMethodAccessorImpl.java:57)
      at sun.reflect.DelegatingMethodAccessorImpl.invoke(DelegatingMethodAccessorImpl.java:43)
      at java.lang.reflect.Method.invoke(Method.java:483)
      at org.testng.internal.MethodInvocationHelper.invokeMethod(MethodInvocationHelper.java:80)
      at org.testng.internal.Invoker.invokeMethod(Invoker.java:715)
      at org.testng.internal.Invoker.invokeTestMethod(Invoker.java:907)
      at org.testng.internal.Invoker.invokeTestMethods(Invoker.java:1237)
      at org.testng.internal.TestMethodWorker.invokeTestMethods(TestMethodWorker.java:127)
      at org.testng.internal.TestMethodWorker.run(TestMethodWorker.java:111)
      at org.testng.TestRunner.privateRun(TestRunner.java:767)
      at org.testng.TestRunner.run(TestRunner.java:617)
      at org.testng.SuiteRunner.runTest(SuiteRunner.java:334)
      at org.testng.SuiteRunner.runSequentially(SuiteRunner.java:329)
      at org.testng.SuiteRunner.privateRun(SuiteRunner.java:291)
      at org.testng.SuiteRunner.run(SuiteRunner.java:240)
      at org.testng.SuiteRunnerWorker.runSuite(SuiteRunnerWorker.java:51)
      at org.testng.SuiteRunnerWorker.run(SuiteRunnerWorker.java:85)
      at org.testng.TestNG.runSuitesSequentially(TestNG.java:1197)
      at org.testng.TestNG.runSuitesLocally(TestNG.java:1122)
      at org.testng.TestNG.run(TestNG.java:1030)
      at com.sun.javatest.regtest.TestNGAction$TestNGRunner.main(TestNGAction.java:155)
      at com.sun.javatest.regtest.TestNGAction$TestNGRunner.main(TestNGAction.java:139)
      at sun.reflect.NativeMethodAccessorImpl.invoke0(Native Method)
      at sun.reflect.NativeMethodAccessorImpl.invoke(NativeMethodAccessorImpl.java:57)
      at sun.reflect.DelegatingMethodAccessorImpl.invoke(DelegatingMethodAccessorImpl.java:43)
      at java.lang.reflect.Method.invoke(Method.java:483)
      at com.sun.javatest.regtest.MainWrapper$MainThread.run(MainWrapper.java:94)
      at java.lang.Thread.run(Thread.java:724)
      Test DefaultMethodsTest.testSuperGenericDisqual FAILED
      config public void separate.TestHarness.printError(org.testng.ITestResult): success
      config public void separate.TestHarness.reset(): success
      test public void vm.DefaultMethodsTest.testSuperNull(): failure
      java.lang.AssertionError: expected [class java.lang.AbstractMethodError] but found [class java.lang.IncompatibleClassChangeError]
      at org.testng.Assert.fail(Assert.java:89)
      at org.testng.Assert.failNotEquals(Assert.java:489)
      at org.testng.Assert.assertEquals(Assert.java:118)
      at org.testng.Assert.assertEquals(Assert.java:160)
      at separate.TestHarness.assertThrows(TestHarness.java:302)
      at separate.TestHarness.assertThrows(TestHarness.java:312)
      at vm.DefaultMethodsTest.testSuperNull(DefaultMethodsTest.java:526)
      at sun.reflect.NativeMethodAccessorImpl.invoke0(Native Method)
      at sun.reflect.NativeMethodAccessorImpl.invoke(NativeMethodAccessorImpl.java:57)
      at sun.reflect.DelegatingMethodAccessorImpl.invoke(DelegatingMethodAccessorImpl.java:43)
      at java.lang.reflect.Method.invoke(Method.java:483)
      at org.testng.internal.MethodInvocationHelper.invokeMethod(MethodInvocationHelper.java:80)
      at org.testng.internal.Invoker.invokeMethod(Invoker.java:715)
      at org.testng.internal.Invoker.invokeTestMethod(Invoker.java:907)
      at org.testng.internal.Invoker.invokeTestMethods(Invoker.java:1237)
      at org.testng.internal.TestMethodWorker.invokeTestMethods(TestMethodWorker.java:127)
      at org.testng.internal.TestMethodWorker.run(TestMethodWorker.java:111)
      at org.testng.TestRunner.privateRun(TestRunner.java:767)
      at org.testng.TestRunner.run(TestRunner.java:617)
      at org.testng.SuiteRunner.runTest(SuiteRunner.java:334)
      at org.testng.SuiteRunner.runSequentially(SuiteRunner.java:329)
      at org.testng.SuiteRunner.privateRun(SuiteRunner.java:291)
      at org.testng.SuiteRunner.run(SuiteRunner.java:240)
      at org.testng.SuiteRunnerWorker.runSuite(SuiteRunnerWorker.java:51)
      at org.testng.SuiteRunnerWorker.run(SuiteRunnerWorker.java:85)
      at org.testng.TestNG.runSuitesSequentially(TestNG.java:1197)
      at org.testng.TestNG.runSuitesLocally(TestNG.java:1122)
      at org.testng.TestNG.run(TestNG.java:1030)
      at com.sun.javatest.regtest.TestNGAction$TestNGRunner.main(TestNGAction.java:155)
      at com.sun.javatest.regtest.TestNGAction$TestNGRunner.main(TestNGAction.java:139)
      at sun.reflect.NativeMethodAccessorImpl.invoke0(Native Method)
      at sun.reflect.NativeMethodAccessorImpl.invoke(NativeMethodAccessorImpl.java:57)
      at sun.reflect.DelegatingMethodAccessorImpl.invoke(DelegatingMethodAccessorImpl.java:43)
      at java.lang.reflect.Method.invoke(Method.java:483)
      at com.sun.javatest.regtest.MainWrapper$MainThread.run(MainWrapper.java:94)
      at java.lang.Thread.run(Thread.java:724)
      Test DefaultMethodsTest.testSuperNull FAILED
      config public void separate.TestHarness.printError(org.testng.ITestResult): success
      config public void separate.TestHarness.reset(): success

      ===============================================
      jdk/lambda/vm/DefaultMethodsTest.java
      Total tests run: 29, Failures: 6, Skips: 0
      ===============================================

      ----------System.err:(14/804)----------
      java.lang.Exception: failures: 6
      at com.sun.javatest.regtest.TestNGAction$TestNGRunner.main(TestNGAction.java:158)
      at com.sun.javatest.regtest.TestNGAction$TestNGRunner.main(TestNGAction.java:139)
      at sun.reflect.NativeMethodAccessorImpl.invoke0(Native Method)
      at sun.reflect.NativeMethodAccessorImpl.invoke(NativeMethodAccessorImpl.java:57)
      at sun.reflect.DelegatingMethodAccessorImpl.invoke(DelegatingMethodAccessorImpl.java:43)
      at java.lang.reflect.Method.invoke(Method.java:483)
      at com.sun.javatest.regtest.MainWrapper$MainThread.run(MainWrapper.java:94)
      at java.lang.Thread.run(Thread.java:724)

      JavaTest Message: Test threw exception: java.lang.Exception: failures: 6
      JavaTest Message: shutting down test

      STATUS:Failed.`main' threw exception: java.lang.Exception: failures: 6
      result: Failed. Execution failed: `main' threw exception: java.lang.Exception: failures: 6


      test result: Failed. Execution failed: `main' threw exception: java.lang.Exception: failures: 6

        Attachments

          Issue Links

            Activity

              People

              • Assignee:
                rfield Robert Field
                Reporter:
                asakharu Aleksandr Sakharuk (Inactive)
              • Votes:
                0 Vote for this issue
                Watchers:
                2 Start watching this issue

                Dates

                • Created:
                  Updated:
                  Resolved: