Uploaded image for project: 'JDK'
  1. JDK
  2. JDK-8029899

java/awt/dnd/URIListBetweenJVMsTest/URIListBetweenJVMsTest fails on openjdk

    Details

    • Subcomponent:
    • OS:
      linux_oracle_6.0

      Description

      Fails on openjdk1.8.0 b119 and b118 and 7u45b18

      ----------System.out:(0/0)----------
      ----------System.err:(12/1307)----------
      /net/stt-13.ru.oracle.com/export2/stt/newroot/regression/workspaces/1.8.0/1.8.0_fcsb119/j2se/test/java/awt/dnd/URIListBetweenJVMsTest/URIListBetweenJVMsTest.jav
      a:40: error: package test.java.awt.regtesthelpers.process does not exist
      import test.java.awt.regtesthelpers.process.ProcessCommunicator;
                                                 ^
      /net/stt-13.ru.oracle.com/export2/stt/newroot/regression/workspaces/1.8.0/1.8.0_fcsb119/j2se/test/java/awt/dnd/URIListBetweenJVMsTest/URIListBetweenJVMsTest.jav
      a:41: error: package test.java.awt.regtesthelpers.process does not exist
      import test.java.awt.regtesthelpers.process.ProcessResults;
                                                 ^
      /net/stt-13.ru.oracle.com/export2/stt/newroot/regression/workspaces/1.8.0/1.8.0_fcsb119/j2se/test/java/awt/dnd/URIListBetweenJVMsTest/URIListBetweenJVMsTest.jav
      a:88: error: cannot access ProcessResults
          private static void verifyTestResults(ProcessResults processResults) {
                                                ^
        bad source file: /net/stt-13.ru.oracle.com/export2/stt/newroot/regression/workspaces/1.8.0/1.8.0_fcsb119/j2se/test/java/awt/regtesthelpers/process/ProcessResu
      lts.java
          file does not contain class ProcessResults
          Please remove or make sure it appears in the correct subdirectory of the sourcepath.
      result: Failed. Compilation failed: Compilation failed


      test result: Failed. Compilation failed: Compilation failed

        Attachments

          Activity

            People

            • Assignee:
              azvegint Alexander Zvegintsev (Inactive)
              Reporter:
              asakharu Aleksandr Sakharuk (Inactive)
            • Votes:
              0 Vote for this issue
              Watchers:
              3 Start watching this issue

              Dates

              • Created:
                Updated:
                Resolved: