Uploaded image for project: 'JDK'
  1. JDK
  2. JDK-8030690

TEST_BUG java/nio/Buffer/Chars.java fails intermittently

    Details

    • Subcomponent:
    • Resolved In Build:
      b01

      Backports

        Description

        TESTFAIL: java/nio/Buffer/Chars.java

        ----------System.out:(48/2727)----------
        [TestNG] Running:
          java/nio/Buffer/Chars.java

        test Chars.testChars(): skip
        java.lang.RuntimeException: java.lang.IllegalArgumentException: bound must be positive
        at org.testng.internal.MethodInvocationHelper.invokeDataProvider(MethodInvocationHelper.java:161)
        at org.testng.internal.Parameters.handleParameters(Parameters.java:429)
        at org.testng.internal.Invoker.handleParameters(Invoker.java:1383)
        at org.testng.internal.Invoker.createParameters(Invoker.java:1075)
        at org.testng.internal.Invoker.invokeTestMethods(Invoker.java:1180)
        at org.testng.internal.TestMethodWorker.invokeTestMethods(TestMethodWorker.java:127)
        at org.testng.internal.TestMethodWorker.run(TestMethodWorker.java:111)
        at org.testng.TestRunner.privateRun(TestRunner.java:767)
        at org.testng.TestRunner.run(TestRunner.java:617)
        at org.testng.SuiteRunner.runTest(SuiteRunner.java:334)
        at org.testng.SuiteRunner.runSequentially(SuiteRunner.java:329)
        at org.testng.SuiteRunner.privateRun(SuiteRunner.java:291)
        at org.testng.SuiteRunner.run(SuiteRunner.java:240)
        at org.testng.SuiteRunnerWorker.runSuite(SuiteRunnerWorker.java:52)
        at org.testng.SuiteRunnerWorker.run(SuiteRunnerWorker.java:86)
        at org.testng.TestNG.runSuitesSequentially(TestNG.java:1224)
        at org.testng.TestNG.runSuitesLocally(TestNG.java:1149)
        at org.testng.TestNG.run(TestNG.java:1057)
        at com.sun.javatest.regtest.TestNGAction$TestNGRunner.main(TestNGAction.java:161)
        at sun.reflect.NativeMethodAccessorImpl.invoke0(Native Method)
        at sun.reflect.NativeMethodAccessorImpl.invoke(NativeMethodAccessorImpl.java:62)
        at sun.reflect.DelegatingMethodAccessorImpl.invoke(DelegatingMethodAccessorImpl.java:43)
        at java.lang.reflect.Method.invoke(Method.java:483)
        at com.sun.javatest.regtest.MainAction$SameVMRunnable.run(MainAction.java:746)
        at java.lang.Thread.run(Thread.java:744)
        Caused by: java.lang.IllegalArgumentException: bound must be positive
        at java.util.Random.nextInt(Random.java:388)
        at Chars.randomizeRange(Chars.java:54)
        at Chars.addCases(Chars.java:95)
        at Chars.createCharBuffers(Chars.java:106)
        at sun.reflect.NativeMethodAccessorImpl.invoke0(Native Method)
        at sun.reflect.NativeMethodAccessorImpl.invoke(NativeMethodAccessorImpl.java:62)
        at sun.reflect.DelegatingMethodAccessorImpl.invoke(DelegatingMethodAccessorImpl.java:43)
        at java.lang.reflect.Method.invoke(Method.java:483)
        at org.testng.internal.MethodInvocationHelper.invokeMethod(MethodInvocationHelper.java:84)
        at org.testng.internal.MethodInvocationHelper.invokeDataProvider(MethodInvocationHelper.java:135)
        ... 24 more

        ===============================================
        java/nio/Buffer/Chars.java
        Total tests run: 1, Failures: 1, Skips: 0
        ===============================================

        ----------System.err:(12/626)----------
        java.lang.Exception: failures: 1
        at com.sun.javatest.regtest.TestNGAction$TestNGRunner.main(TestNGAction.java:164)
        at sun.reflect.NativeMethodAccessorImpl.invoke0(Native Method)
        at sun.reflect.NativeMethodAccessorImpl.invoke(NativeMethodAccessorImpl.java:62)
        at sun.reflect.DelegatingMethodAccessorImpl.invoke(DelegatingMethodAccessorImpl.java:43)
        at java.lang.reflect.Method.invoke(Method.java:483)
        at com.sun.javatest.regtest.MainAction$SameVMRunnable.run(MainAction.java:746)
        at java.lang.Thread.run(Thread.java:744)

        JavaTest Message: Test threw exception: java.lang.Exception
        JavaTest Message: shutting down test

        result: Failed. Execution failed: `main' threw exception: java.lang.Exception: failures: 1


        test result: Failed. Execution failed: `main' threw exception: java.lang.Exception: failures: 1

          Attachments

            Issue Links

              Activity

                People

                • Assignee:
                  ewang Eric Wang (Inactive)
                  Reporter:
                  ewang Eric Wang (Inactive)
                • Votes:
                  0 Vote for this issue
                  Watchers:
                  3 Start watching this issue

                  Dates

                  • Created:
                    Updated:
                    Resolved: