Uploaded image for project: 'JDK'
  1. JDK
  2. JDK-8031661

java/net/Authenticator/B4769350.java failed intermittently

    Details

    • Subcomponent:
    • Resolved In Build:
      b04
    • OS:
      solaris
    • Verification:
      Not verified

      Backports

        Description

        TESTFAIL:java/net/Authenticator/B4769350.java
        This test failed once in jdk8/b120 Solaris same-binaries run:

        ----------System.err:(16/909)----------
        java.lang.RuntimeException: Authenticator was called 3 times. Should be 2
        at B4769350.except(B4769350.java:493)
        at B4769350.doServerTests(B4769350.java:416)
        at B4769350.runTest(B4769350.java:485)
        at B4769350.main(B4769350.java:468)
        at sun.reflect.NativeMethodAccessorImpl.invoke0(Native Method)
        at sun.reflect.NativeMethodAccessorImpl.invoke(NativeMethodAccessorImpl.java:62)
        at sun.reflect.DelegatingMethodAccessorImpl.invoke(DelegatingMethodAccessorImpl.java:43)
        at java.lang.reflect.Method.invoke(Method.java:483)
        at com.sun.javatest.regtest.MainWrapper$MainThread.run(MainWrapper.java:94)
        at java.lang.Thread.run(Thread.java:744)

        JavaTest Message: Test threw exception: java.lang.RuntimeException: Authenticator was called 3 times. Should be 2
        JavaTest Message: shutting down test

        STATUS:Failed.`main' threw exception: java.lang.RuntimeException: Authenticator was called 3 times. Should be 2

          Attachments

            Issue Links

              Activity

                People

                • Assignee:
                  amjiang Amanda Jiang
                  Reporter:
                  amjiang Amanda Jiang
                • Votes:
                  0 Vote for this issue
                  Watchers:
                  6 Start watching this issue

                  Dates

                  • Created:
                    Updated:
                    Resolved: