Uploaded image for project: 'JDK'
  1. JDK
  2. JDK-8031785

java/net/URLPermission/URLPermissionTest.java fails on cpu build

    Details

      Description

      fails on jdk1.8.0b122cpu and jdk1.8.0b121cpu

      ----------System.err:(77/4895)----------
      java.lang.IllegalArgumentException: Invalid characters in hostname
      at java.net.HostPortrange.toLowerCase(HostPortrange.java:189)
      at java.net.HostPortrange.<init>(HostPortrange.java:150)
      at java.net.URLPermission$Authority.<init>(URLPermission.java:476)
      at java.net.URLPermission.parseURI(URLPermission.java:446)
      at java.net.URLPermission.init(URLPermission.java:167)
      at java.net.URLPermission.<init>(URLPermission.java:163)
      at java.net.URLPermission.<init>(URLPermission.java:203)
      at URLPermissionTest$URLEqualityTest.execute(URLPermissionTest.java:169)
      at URLPermissionTest.main(URLPermissionTest.java:386)
      at sun.reflect.NativeMethodAccessorImpl.invoke0(Native Method)
      at sun.reflect.NativeMethodAccessorImpl.invoke(NativeMethodAccessorImpl.java:62)
      at sun.reflect.DelegatingMethodAccessorImpl.invoke(DelegatingMethodAccessorImpl.java:43)
      at java.lang.reflect.Method.invoke(Method.java:483)
      at com.sun.javatest.regtest.MainWrapper$MainThread.run(MainWrapper.java:94)
      at java.lang.Thread.run(Thread.java:744)
      java.lang.IllegalArgumentException: Invalid characters in hostname
      at java.net.HostPortrange.toLowerCase(HostPortrange.java:189)
      at java.net.HostPortrange.<init>(HostPortrange.java:150)
      at java.net.URLPermission$Authority.<init>(URLPermission.java:476)
      at java.net.URLPermission.parseURI(URLPermission.java:446)
      at java.net.URLPermission.init(URLPermission.java:167)
      at java.net.URLPermission.<init>(URLPermission.java:163)
      at java.net.URLPermission.<init>(URLPermission.java:203)
      at URLPermissionTest$URLEqualityTest.execute(URLPermissionTest.java:169)
      at URLPermissionTest.main(URLPermissionTest.java:386)
      at sun.reflect.NativeMethodAccessorImpl.invoke0(Native Method)
      at sun.reflect.NativeMethodAccessorImpl.invoke(NativeMethodAccessorImpl.java:62)
      at sun.reflect.DelegatingMethodAccessorImpl.invoke(DelegatingMethodAccessorImpl.java:43)
      at java.lang.reflect.Method.invoke(Method.java:483)
      at com.sun.javatest.regtest.MainWrapper$MainThread.run(MainWrapper.java:94)
      at java.lang.Thread.run(Thread.java:744)
      java.lang.IllegalArgumentException: Invalid characters in hostname
      at java.net.HostPortrange.toLowerCase(HostPortrange.java:189)
      at java.net.HostPortrange.<init>(HostPortrange.java:150)
      at java.net.URLPermission$Authority.<init>(URLPermission.java:476)
      at java.net.URLPermission.parseURI(URLPermission.java:446)
      at java.net.URLPermission.init(URLPermission.java:167)
      at java.net.URLPermission.<init>(URLPermission.java:163)
      at java.net.URLPermission.<init>(URLPermission.java:203)
      at URLPermissionTest$URLEqualityTest.execute(URLPermissionTest.java:169)
      at URLPermissionTest.main(URLPermissionTest.java:386)
      at sun.reflect.NativeMethodAccessorImpl.invoke0(Native Method)
      at sun.reflect.NativeMethodAccessorImpl.invoke(NativeMethodAccessorImpl.java:62)
      at sun.reflect.DelegatingMethodAccessorImpl.invoke(DelegatingMethodAccessorImpl.java:43)
      at java.lang.reflect.Method.invoke(Method.java:483)
      at com.sun.javatest.regtest.MainWrapper$MainThread.run(MainWrapper.java:94)
      at java.lang.Thread.run(Thread.java:744)
      java.lang.IllegalArgumentException: Invalid characters in hostname
      at java.net.HostPortrange.toLowerCase(HostPortrange.java:189)
      at java.net.HostPortrange.<init>(HostPortrange.java:150)
      at java.net.URLPermission$Authority.<init>(URLPermission.java:476)
      at java.net.URLPermission.parseURI(URLPermission.java:446)
      at java.net.URLPermission.init(URLPermission.java:167)
      at java.net.URLPermission.<init>(URLPermission.java:163)
      at java.net.URLPermission.<init>(URLPermission.java:203)
      at URLPermissionTest$URLEqualityTest.execute(URLPermissionTest.java:169)
      at URLPermissionTest.main(URLPermissionTest.java:386)
      at sun.reflect.NativeMethodAccessorImpl.invoke0(Native Method)
      at sun.reflect.NativeMethodAccessorImpl.invoke(NativeMethodAccessorImpl.java:62)
      at sun.reflect.DelegatingMethodAccessorImpl.invoke(DelegatingMethodAccessorImpl.java:43)
      at java.lang.reflect.Method.invoke(Method.java:483)
      at com.sun.javatest.regtest.MainWrapper$MainThread.run(MainWrapper.java:94)
      at java.lang.Thread.run(Thread.java:744)
      java.lang.RuntimeException: some tests failed
      at URLPermissionTest.main(URLPermissionTest.java:459)
      at sun.reflect.NativeMethodAccessorImpl.invoke0(Native Method)
      at sun.reflect.NativeMethodAccessorImpl.invoke(NativeMethodAccessorImpl.java:62)
      at sun.reflect.DelegatingMethodAccessorImpl.invoke(DelegatingMethodAccessorImpl.java:43)
      at java.lang.reflect.Method.invoke(Method.java:483)
      at com.sun.javatest.regtest.MainWrapper$MainThread.run(MainWrapper.java:94)
      at java.lang.Thread.run(Thread.java:744)

      JavaTest Message: Test threw exception: java.lang.RuntimeException: some tests failed
      JavaTest Message: shutting down test

        Attachments

          Activity

            People

            • Assignee:
              Unassigned
              Reporter:
              asakharu Aleksandr Sakharuk (Inactive)
            • Votes:
              0 Vote for this issue
              Watchers:
              4 Start watching this issue

              Dates

              • Created:
                Updated:
                Resolved: