Uploaded image for project: 'JDK'
  1. JDK
  2. JDK-8034200

Test java/net/CookieHandler/LocalHostCookie.java fails after fix of JDK-7169142

    XMLWordPrintable

    Details

    • Subcomponent:
    • Resolved In Build:
      b01
    • CPU:
      generic
    • OS:
      generic

      Backports

        Description

        Testsuite name: Regression
        Test name: java/net/CookieHandler/LocalHostCookie.java
        JDK tested: 7u60 nightly build: /net/aurora-ds.us.oracle.com/data/export/aurora/sca/scanas411/export/java-re/build/re3/nightlyws/jdk7u-dev/b01_2014-02-07-1902_709/ws-b01_2014-02-07-1902_709/build
        http://aurora-ds.us.oracle.com:9502/scanas411/export/java-re/build/re3/nightlyws/jdk7u-dev/b01_2014-02-07-1902_709/ws-b01_2014-02-07-1902_709/build
        OS tested: All

        Test seems to fail after fix of JDK-7169142.

        LOG:

        #section:main
        ----------messages:(3/125)----------
        command: main LocalHostCookie
        reason: User specified action: run main/othervm LocalHostCookie
        elapsed time (seconds): 0.132
        ----------System.out:(0/0)----------
        ----------System.err:(14/751)----------
        java.lang.RuntimeException: Test failed!
        at LocalHostCookie.runTest(LocalHostCookie.java:71)
        at LocalHostCookie.main(LocalHostCookie.java:42)
        at sun.reflect.NativeMethodAccessorImpl.invoke0(Native Method)
        at sun.reflect.NativeMethodAccessorImpl.invoke(NativeMethodAccessorImpl.java:57)
        at sun.reflect.DelegatingMethodAccessorImpl.invoke(DelegatingMethodAccessorImpl.java:43)
        at java.lang.reflect.Method.invoke(Method.java:606)
        at com.sun.javatest.regtest.MainWrapper$MainThread.run(MainWrapper.java:94)
        at java.lang.Thread.run(Thread.java:744)

        JavaTest Message: Test threw exception: java.lang.RuntimeException: Test failed!
        JavaTest Message: shutting down test

        STATUS:Failed.`main' threw exception: java.lang.RuntimeException: Test failed!

          Attachments

            Issue Links

              Activity

                People

                Assignee:
                dmeetry Dmeetry Degrave (Inactive)
                Reporter:
                kshefov Konstantin Shefov
                Votes:
                0 Vote for this issue
                Watchers:
                7 Start watching this issue

                  Dates

                  Created:
                  Updated:
                  Resolved: