Uploaded image for project: 'JDK'
  1. JDK
  2. JDK-8037093

java/util/concurrent/locks/Lock/TimedAcquireLeak.java fails intermittently

    XMLWordPrintable

    Details

      Backports

        Description

        TESTFAIL:java/util/concurrent/locks/Lock/TimedAcquireLeak.java

        java/util/concurrent/locks/Lock/TimedAcquireLeak.java failed in jdk9/b03 same binaries run, one time on one platform so far (out of 340 runs in total):

        ----------System.out:(4/35)----------
        12 -> 10

        Passed = 12, failed = 1

        ----------System.err:(24/1322)----------
        java.lang.Exception: Stack trace
        at java.lang.Thread.dumpStack(Thread.java:1328)
        at TimedAcquireLeak.fail(TimedAcquireLeak.java:260)
        at TimedAcquireLeak.check(TimedAcquireLeak.java:263)
        at TimedAcquireLeak.realMain(TimedAcquireLeak.java:171)
        at TimedAcquireLeak.main(TimedAcquireLeak.java:269)
        at sun.reflect.NativeMethodAccessorImpl.invoke0(Native Method)
        at sun.reflect.NativeMethodAccessorImpl.invoke(NativeMethodAccessorImpl.java:62)
        at sun.reflect.DelegatingMethodAccessorImpl.invoke(DelegatingMethodAccessorImpl.java:43)
        at java.lang.reflect.Method.invoke(Method.java:484)
        at com.sun.javatest.regtest.MainAction$SameVMRunnable.run(MainAction.java:754)
        at java.lang.Thread.run(Thread.java:744)
        java.lang.AssertionError: Some tests failed
        at TimedAcquireLeak.main(TimedAcquireLeak.java:271)
        at sun.reflect.NativeMethodAccessorImpl.invoke0(Native Method)
        at sun.reflect.NativeMethodAccessorImpl.invoke(NativeMethodAccessorImpl.java:62)
        at sun.reflect.DelegatingMethodAccessorImpl.invoke(DelegatingMethodAccessorImpl.java:43)
        at java.lang.reflect.Method.invoke(Method.java:484)
        at com.sun.javatest.regtest.MainAction$SameVMRunnable.run(MainAction.java:754)
        at java.lang.Thread.run(Thread.java:744)

        JavaTest Message: Test threw exception: java.lang.AssertionError
        JavaTest Message: shutting down test

        result: Failed. Execution failed: `main' threw exception: java.lang.AssertionError: Some tests failed

          Attachments

            Issue Links

              Activity

                People

                Assignee:
                martin Martin Buchholz
                Reporter:
                amlu Amy Lu (Inactive)
                Votes:
                0 Vote for this issue
                Watchers:
                9 Start watching this issue

                  Dates

                  Created:
                  Updated:
                  Resolved: