Uploaded image for project: 'JDK'
  1. JDK
  2. JDK-8043477

[TEST_BUG] java/lang/ProcessBuilder/Basic.java failed with: java.lang.AssertionError: Some tests failed

    Details

    • Subcomponent:
    • Resolved In Build:
      b40

      Backports

        Description

        ----------System.err:(19/1050)----------
        Java HotSpot(TM) Client VM warning: TieredCompilation is disabled in this release.
        java.io.IOException: Stream closed
        at java.io.BufferedInputStream.getBufIfOpen(BufferedInputStream.java:170)
        at java.io.BufferedInputStream.fill(BufferedInputStream.java:214)
        at java.io.BufferedInputStream.read(BufferedInputStream.java:265)
        at Basic$65.run(Basic.java:2073)
        java.lang.AssertionError: Some tests failed
        at Basic.main(Basic.java:2535)
        at sun.reflect.NativeMethodAccessorImpl.invoke0(Native Method)
        at sun.reflect.NativeMethodAccessorImpl.invoke(NativeMethodAccessorImpl.java:62)
        at sun.reflect.DelegatingMethodAccessorImpl.invoke(DelegatingMethodAccessorImpl.java:43)
        at java.lang.reflect.Method.invoke(Method.java:484)
        at com.sun.javatest.regtest.MainWrapper$MainThread.run(MainWrapper.java:94)
        at java.lang.Thread.run(Thread.java:745)

          Attachments

            Issue Links

              Activity

                People

                • Assignee:
                  rriggs Roger Riggs
                  Reporter:
                  twisti Christian Thalinger
                • Votes:
                  0 Vote for this issue
                  Watchers:
                  8 Start watching this issue

                  Dates

                  • Created:
                    Updated:
                    Resolved: