Uploaded image for project: 'JDK'
  1. JDK
  2. JDK-8049978

nsk/jdb/uncaught_exception/uncaught_exception002 fails with Caught unexpected exception TenMultipleException

    Details

    • Subcomponent:
      svc

      Description

      [2014-07-10T15:28:28.84] Waiting for jdb exits
      [2014-07-10T15:28:28.84] jdb normally exited
      [2014-07-10T15:28:28.85] # ERROR: Caught unexpected exception: nsk.share.TestFailure: nsk.share.jdb.DebuggeeUncaughtException: nsk.jdb.uncaught_exception.uncaught_exception002.TenMultipleException
      [2014-07-10T15:28:28.87] nsk.share.TestFailure: nsk.share.jdb.DebuggeeUncaughtException: nsk.jdb.uncaught_exception.uncaught_exception002.TenMultipleException
      [2014-07-10T15:28:28.87] at nsk.share.jdb.JdbTest.runTest(JdbTest.java:137)
      [2014-07-10T15:28:28.87] at nsk.jdb.uncaught_exception.uncaught_exception002.uncaught_exception002.run(uncaught_exception002.java:23)
      [2014-07-10T15:28:28.88] at nsk.jdb.uncaught_exception.uncaught_exception002.uncaught_exception002.main(uncaught_exception002.java:16)
      [2014-07-10T15:28:28.89] Caused by: nsk.share.jdb.DebuggeeUncaughtException: nsk.jdb.uncaught_exception.uncaught_exception002.TenMultipleException
      [2014-07-10T15:28:28.90] at nsk.share.jdb.Jdb.waitForPrompt(Jdb.java:438)
      [2014-07-10T15:28:28.90] at nsk.share.jdb.Jdb.receiveReply(Jdb.java:365)
      [2014-07-10T15:28:28.90] at nsk.share.jdb.Jdb.receiveReplyFor(Jdb.java:331)
      [2014-07-10T15:28:28.90] at nsk.share.jdb.Jdb.receiveReplyFor(Jdb.java:313)
      [2014-07-10T15:28:28.90] at nsk.share.jdb.Jdb.receiveReplyFor(Jdb.java:302)
      [2014-07-10T15:28:28.90] at nsk.jdb.uncaught_exception.uncaught_exception002.uncaught_exception002.runCases(uncaught_exception002.java:48)
      [2014-07-10T15:28:28.90] at nsk.share.jdb.JdbTest.runTest(JdbTest.java:130)
      [2014-07-10T15:28:28.90] ... 2 more
      [2014-07-10T15:28:28.91] # ERROR: jdb reference is null, cannot run jdb.finalize() method
      [2014-07-10T15:28:28.91] # ERROR: debuggee reference is null, cannot run debuggee.finalize() method
      [2014-07-10T15:28:28.91] # ERROR: TEST FAILED

      ILW = MLH

        Attachments

          Issue Links

            Activity

              People

              • Assignee:
                bmoloden Boris Molodenkov (Inactive)
                Reporter:
                roland Roland Westrelin
              • Votes:
                0 Vote for this issue
                Watchers:
                1 Start watching this issue

                Dates

                • Created:
                  Updated:
                  Resolved: