Uploaded image for project: 'JDK'
  1. JDK
  2. JDK-8053916

java/util/logging/LoggingDeadlock2.java fails with "Exception: Stack trace"

    Details

      Description

      From the log files:
      ----------System.out:(5/663)*----------
      [C:\\local\\aurora\\sandbox\\sca\\vmsqe\\jdk\\nightly\\fastdebug\\comp_baseline\\windows-i586\\jre\\bin\\java, -classpath, C:\\local\\aurora\\sandbox\\sca\\vmsqe\\tool\\jtreg\\execution\\lib\\javatest.jar;C:\\local\\aurora\\sandbox\\sca\\vmsqe\\tool\\jtreg\\execution\\lib\\jtreg.jar;C:\\local\\aurora\\sandbox\\results\\workDir\\classes\\0\\java\\util\\logging;C:\\local\\aurora\\sandbox\\sca\\vmsqe\\testbase\\jtreg\\nightly\\comp_baseline\\JT_JDK\\test\\java\\util\\logging;C:\\local\\aurora\\sandbox\\sca\\vmsqe\\jdk\\nightly\\fastdebug\\comp_baseline\\windows-i586\\lib\\tools.jar, LoggingDeadlock2$JavaChild]
      0 not equal to 99

      Passed = 2, failed = 1

      ----------System.err:(26/1495)----------
      java.lang.Exception: Stack trace
      at java.lang.Thread.dumpStack(Thread.java:1329)
      at LoggingDeadlock2.fail(LoggingDeadlock2.java:227)
      at LoggingDeadlock2.fail(LoggingDeadlock2.java:228)
      at LoggingDeadlock2.equal(LoggingDeadlock2.java:234)
      at LoggingDeadlock2.realMain(LoggingDeadlock2.java:67)
      at LoggingDeadlock2.main(LoggingDeadlock2.java:236)
      at sun.reflect.NativeMethodAccessorImpl.invoke0(Native Method)
      at sun.reflect.NativeMethodAccessorImpl.invoke(NativeMethodAccessorImpl.java:62)
      at sun.reflect.DelegatingMethodAccessorImpl.invoke(DelegatingMethodAccessorImpl.java:43)
      at java.lang.reflect.Method.invoke(Method.java:484)
      at com.sun.javatest.regtest.MainWrapper$MainThread.run(MainWrapper.java:94)
      at java.lang.Thread.run(Thread.java:745)
      java.lang.AssertionError: Some tests failed
      at LoggingDeadlock2.main(LoggingDeadlock2.java:238)
      at sun.reflect.NativeMethodAccessorImpl.invoke0(Native Method)
      at sun.reflect.NativeMethodAccessorImpl.invoke(NativeMethodAccessorImpl.java:62)
      at sun.reflect.DelegatingMethodAccessorImpl.invoke(DelegatingMethodAccessorImpl.java:43)
      at java.lang.reflect.Method.invoke(Method.java:484)
      at com.sun.javatest.regtest.MainWrapper$MainThread.run(MainWrapper.java:94)
      at java.lang.Thread.run(Thread.java:745)

      JavaTest Message: Test threw exception: java.lang.AssertionError: Some tests failed
      JavaTest Message: shutting down test

      STATUS:Failed.`main' threw exception: java.lang.AssertionError: Some tests failed

        Attachments

          Activity

            People

            • Assignee:
              dfuchs Daniel Fuchs
              Reporter:
              roland Roland Westrelin
            • Votes:
              0 Vote for this issue
              Watchers:
              2 Start watching this issue

              Dates

              • Created:
                Updated:
                Resolved: