Uploaded image for project: 'JDK'
  1. JDK
  2. JDK-8056077

Test java/awt/image/DrawImage/IncorrectAlphaSurface2SW.java fails

    Details

    • Subcomponent:
      2d
    • CPU:
      generic
    • OS:
      linux

      Description

      Test name(s):java/awt/image/DrawImage/IncorrectAlphaSurface2SW.java
      JDK tested: jdk1.8_20b26,jdk1.8.0_20b25
      OS tested: Oracle Linux 7
      Is it a regression? No
      Regression introduced in release/build: N/A
                   
      Is it platform specific? Yes
          
      The is failure reproduced: Oracle Linux 7

      ----------System.err:(16/831)----------
      Expected color = 1540029
      Actual color = 0
      java.lang.RuntimeException: Test failed.
      at IncorrectAlphaSurface2SW.validate(IncorrectAlphaSurface2SW.java:138)
      at IncorrectAlphaSurface2SW.main(IncorrectAlphaSurface2SW.java:91)
      at sun.reflect.NativeMethodAccessorImpl.invoke0(Native Method)
      at sun.reflect.NativeMethodAccessorImpl.invoke(NativeMethodAccessorImpl.java:62)
      at sun.reflect.DelegatingMethodAccessorImpl.invoke(DelegatingMethodAccessorImpl.java:43)
      at java.lang.reflect.Method.invoke(Method.java:483)
      at com.sun.javatest.regtest.MainWrapper$MainThread.run(MainWrapper.java:94)
      at java.lang.Thread.run(Thread.java:745)

      JavaTest Message: Test threw exception: java.lang.RuntimeException: Test failed.
      JavaTest Message: shutting down test

      STATUS:Failed.`main' threw exception: java.lang.RuntimeException: Test failed.

        Attachments

          Activity

            People

            • Assignee:
              prr Philip Race
              Reporter:
              pchopra Pooja Chopra (Inactive)
            • Votes:
              0 Vote for this issue
              Watchers:
              7 Start watching this issue

              Dates

              • Created:
                Updated: