Uploaded image for project: 'JDK'
  1. JDK
  2. JDK-8057940

JCK test api/java_awt/Image/renderable/ParameterBlock fails with StackOverflowError

    XMLWordPrintable

    Details

    • Subcomponent:
      2d
    • Introduced In Version:
      9
    • Resolved In Build:
      b33

      Backports

        Description

        ----------------------------------------------------------------
                       AssertionTest Report
        ----------------------------------------------------------------
         Method Name : public java.awt.image.renderable.ParameterBlock java.awt.image.renderable.ParameterBlock.add(int)
         Class Name : class java.awt.image.renderable.ParameterBlock
        ----------------------------------------------------------------
        --------------------------------------------------------------
         Index of factory objects : 0:0
         Test Status : Unexpected Exception: java.lang.StackOverflowError raised
        --------------------------------------------------------------
        --------------------------------------------------------------
         Index of factory objects : 0:1
         Test Status : Unexpected Exception: java.lang.StackOverflowError raised
        --------------------------------------------------------------
        --------------------------------------------------------------
         Index of factory objects : 0:2
         Test Status : Unexpected Exception: java.lang.StackOverflowError raised
        --------------------------------------------------------------
        --------------------------------------------------------------------
                       Overall AssertionTest Result Summary
        --------------------------------------------------------------------
         Overall Test Status : Failed
         Total Number of Tests : 3
         Total Tests Passed : 0
         Total Tests Failed : 3
        --------------------------------------------------------------------
        result: Failed. test cases: 3; all failed; first test case failure: 0:0

          Attachments

            Issue Links

              Activity

                People

                Assignee:
                alexsch Alexandr Scherbatiy
                Reporter:
                alexsch Alexandr Scherbatiy
                Votes:
                0 Vote for this issue
                Watchers:
                3 Start watching this issue

                  Dates

                  Created:
                  Updated:
                  Resolved: