Uploaded image for project: 'JDK'
  1. JDK
  2. JDK-8058766

nsk.share.TestFailure: Cannot find golden stack in jstack output

    Details

    • Type: Bug
    • Status: Closed
    • Priority: P3
    • Resolution: Duplicate
    • Affects Version/s: 9
    • Fix Version/s: None
    • Component/s: hotspot
    • Subcomponent:
    • CPU:
      sparc
    • OS:
      solaris_11

      Description

      The following two tests failed:

      tmtools/jstack/stacktrace-m/mixed_stack_jn_core
      tmtools/jstack/stacktrace-m/mixed_stack_jn_live


      [2014-09-18T04:22:40.85] Unexpected method found: void JavaCalls::call_helper(JavaValue*,methodHandle*,JavaCallArguments*,Thread*)
      [2014-09-18T04:22:40.85] Expected method : tmtools.jstack.share.debuggee.nativestack.SimpleStackDebuggee.nativeStack
      [2014-09-18T04:22:40.85] - mismatch.
      [2014-09-18T04:22:40.85] Comparing stacks of thread "t@22"
      [2014-09-18T04:22:40.85] - mismatch.
      [2014-09-18T04:22:40.85] Comparing stacks of thread "t@25"
      [2014-09-18T04:22:40.85] - mismatch.
      [2014-09-18T04:22:40.85] Comparing stacks of thread "t@24"
      [2014-09-18T04:22:40.85] - mismatch.
      [2014-09-18T04:22:40.85] Comparing stacks of thread "t@21"
      [2014-09-18T04:22:40.85] - mismatch.
      [2014-09-18T04:22:40.85] Comparing stacks of thread "t@20"
      [2014-09-18T04:22:40.86] nsk.share.TestFailure: Cannot find golden stack in jstack output
      [2014-09-18T04:22:40.86] at tmtools.jstack.share.analyzers.MixedNativeStackAnalyser.analyzeStack(MixedNativeStackAnalyser.java:88)
      [2014-09-18T04:22:40.86] at tmtools.jstack.share.analyzers.MixedNativeStackAnalyser.analyse(MixedNativeStackAnalyser.java:50)
      [2014-09-18T04:22:40.86] at tmtools.share.Test.doTest(Test.java:215)
      [2014-09-18T04:22:40.86] at tmtools.share.TestSuite.execute(TestSuite.java:172)
      [2014-09-18T04:22:40.86] at tmtools.share.TestSuite.main(TestSuite.java:206)
      [2014-09-18T04:22:40.87] - mismatch.
      [2014-09-18T04:22:40.94] -> Posting command: class tmtools.share.distributed.protocol.request.DebuggeeKillRequest
      [2014-09-18T04:22:40.94] -> Got command: class tmtools.share.distributed.protocol.response.StandardClientAnswer
      [2014-09-18T04:22:40.94] FAILED
      [2014-09-18T04:22:40.94] Test tesults:
      [2014-09-18T04:22:40.94] nsk.share.TestFailure: Cannot find golden stack in jstack output
      [2014-09-18T04:22:40.94] at tmtools.jstack.share.analyzers.MixedNativeStackAnalyser.analyzeStack(MixedNativeStackAnalyser.java:88)
      [2014-09-18T04:22:40.94] at tmtools.jstack.share.analyzers.MixedNativeStackAnalyser.analyse(MixedNativeStackAnalyser.java:50)
      [2014-09-18T04:22:40.94] at tmtools.share.Test.doTest(Test.java:215)
      [2014-09-18T04:22:40.94] at tmtools.share.TestSuite.execute(TestSuite.java:172)
      [2014-09-18T04:22:40.94] at tmtools.share.TestSuite.main(TestSuite.java:206)
      [2014-09-18T04:22:40.94] FAILED: mixed_stack_jn. The reason: Cannot find golden stack in jstack output
      [2014-09-18T04:22:40.96] Shutting down Tonga syncronizer...
      [2014-09-18T04:22:40.96] Shutting down Debuggee Control Center...
      [2014-09-18T04:22:40.98] -> Posting command: class tmtools.share.distributed.protocol.request.ShutDownRequest
      [2014-09-18T04:22:40.98] Exception in thread "main" nsk.share.Failure: Test suite execution failed
      [2014-09-18T04:22:40.98] at tmtools.share.TestSuite.main(TestSuite.java:227)
      [2014-09-18T04:22:41.00] java.io.IOException: Stream closed
      [2014-09-18T04:22:41.00] at java.io.BufferedInputStream.getInIfOpen(BufferedInputStream.java:159)
      [2014-09-18T04:22:41.00] at java.io.BufferedInputStream.available(BufferedInputStream.java:410)
      [2014-09-18T04:22:41.00] at tonga.external.appsync.SyncInputStream.syncRead(SyncInputStream.java:87)
      [2014-09-18T04:22:41.00] at tonga.external.appsync.ApplicationSync.lookForCmdString(ApplicationSync.java:100)
      [2014-09-18T04:22:41.00] at tonga.external.appsync.ApplicationSync.run(ApplicationSync.java:82)
      [2014-09-18T04:22:41.11] -> Got command: class tmtools.share.distributed.protocol.response.StandardClientAnswer

        Attachments

          Activity

            People

            • Assignee:
              Unassigned
              Reporter:
              iklam Ioi Lam
            • Votes:
              0 Vote for this issue
              Watchers:
              2 Start watching this issue

              Dates

              • Created:
                Updated:
                Resolved: