Uploaded image for project: 'JDK'
  1. JDK
  2. JDK-8064572

sun/jvmstat/monitor/MonitoredVm/CR6672135.java: java.lang.IllegalArgumentException: Process not found

    Details

    • Subcomponent:
      svc

      Description

      This is probably another manifestation of the problems seen in JDK-8062938 and JDK-8060736.


      #section:main
      ----------messages:(3/147)----------
      command: main -XX:+UsePerfData CR6672135
      reason: User specified action: run main/othervm -XX:+UsePerfData CR6672135
      elapsed time (seconds): 6.245
      ----------System.out:(0/0)----------
      ----------System.err:(26/1484)----------
      java.lang.Error: Test failed
      at CR6672135.main(CR6672135.java:60)
      at sun.reflect.NativeMethodAccessorImpl.invoke0(Native Method)
      at sun.reflect.NativeMethodAccessorImpl.invoke(NativeMethodAccessorImpl.java:62)
      at sun.reflect.DelegatingMethodAccessorImpl.invoke(DelegatingMethodAccessorImpl.java:43)
      at java.lang.reflect.Method.invoke(Method.java:498)
      at com.sun.javatest.regtest.MainWrapper$MainThread.run(MainWrapper.java:94)
      at java.lang.Thread.run(Thread.java:745)
      Caused by: sun.jvmstat.monitor.MonitorException: 8771 not found
      at sun.jvmstat.perfdata.monitor.protocol.local.PerfDataBuffer.<init>(PerfDataBuffer.java:84)
      at sun.jvmstat.perfdata.monitor.protocol.local.LocalMonitoredVm.<init>(LocalMonitoredVm.java:68)
      at sun.jvmstat.perfdata.monitor.protocol.local.MonitoredHostProvider.getMonitoredVm(MonitoredHostProvider.java:77)
      at sun.jvmstat.perfdata.monitor.protocol.local.MonitoredHostProvider.getMonitoredVm(MonitoredHostProvider.java:67)
      at CR6672135.main(CR6672135.java:53)
      ... 6 more
      Caused by: java.lang.IllegalArgumentException: Process not found
      at sun.misc.Perf.attach(Native Method)
      at sun.misc.Perf.attachImpl(Perf.java:270)
      at sun.misc.Perf.attach(Perf.java:200)
      at sun.jvmstat.perfdata.monitor.protocol.local.PerfDataBuffer.<init>(PerfDataBuffer.java:64)
      ... 10 more

      JavaTest Message: Test threw exception: java.lang.Error: Test failed
      JavaTest Message: shutting down test


      RULE sun/jvmstat/monitor/MonitoredVm/CR6672135.java Exception java.lang.IllegalArgumentException: Process not found

        Attachments

          Issue Links

            Activity

              People

              • Assignee:
                ykantser Yekaterina Kantserova (Inactive)
                Reporter:
                sla Staffan Larsen (Inactive)
              • Votes:
                0 Vote for this issue
                Watchers:
                2 Start watching this issue

                Dates

                • Created:
                  Updated:
                  Resolved: