Uploaded image for project: 'JDK'
  1. JDK
  2. JDK-8071535

nightly failure in nsk/jdwp/Event/VM_DEATH/vmdeath002

    XMLWordPrintable

    Details

    • Type: Bug
    • Status: Closed
    • Priority: P1
    • Resolution: Duplicate
    • Affects Version/s: 9
    • Fix Version/s: 9
    • Component/s: core-svc
    • Labels:

      Description

      [2015-01-24T11:14:10.66] Waiting for debuggee exit
      [2015-01-24T11:14:31.95] ... debuggee exited with exit code: 11
      [2015-01-24T11:14:31.96] # ERROR: Debuggee FAILED with exit code: 11
      [2015-01-24T11:14:32.04] The following stacktrace is for Aurora. Used to create a RULE:
      [2015-01-24T11:14:32.05] nsk.share.TestFailure: Debuggee FAILED with exit code: 11
      [2015-01-24T11:14:32.05] at nsk.share.Log.logExceptionForAurora(Log.java:410)
      [2015-01-24T11:14:32.06] at nsk.share.Log.complain(Log.java:379)
      [2015-01-24T11:14:32.06] at nsk.jdwp.Event.VM_DEATH.vmdeath002.quitDebugee(vmdeath002.java:529)
      [2015-01-24T11:14:32.06] at nsk.jdwp.Event.VM_DEATH.vmdeath002.runIt(vmdeath002.java:186)
      [2015-01-24T11:14:32.06] at nsk.jdwp.Event.VM_DEATH.vmdeath002.run(vmdeath002.java:76)
      [2015-01-24T11:14:32.06] at nsk.jdwp.Event.VM_DEATH.vmdeath002.main(vmdeath002.java:69)
      [2015-01-24T11:14:32.06] # ERROR: TEST FAILED
      [2015-01-24T11:14:32.06] The following stacktrace is for Aurora. Used to create a RULE:
      [2015-01-24T11:14:32.06] nsk.share.TestFailure: TEST FAILED
      [2015-01-24T11:14:32.06] at nsk.share.Log.logExceptionForAurora(Log.java:410)
      [2015-01-24T11:14:32.06] at nsk.share.Log.complain(Log.java:379)
      [2015-01-24T11:14:32.06] at nsk.jdwp.Event.VM_DEATH.vmdeath002.runIt(vmdeath002.java:191)
      [2015-01-24T11:14:32.06] at nsk.jdwp.Event.VM_DEATH.vmdeath002.run(vmdeath002.java:76)
      [2015-01-24T11:14:32.06] at nsk.jdwp.Event.VM_DEATH.vmdeath002.main(vmdeath002.java:69)
      [2015-01-24T11:14:32.08]
      [2015-01-24T11:14:32.08]
      [2015-01-24T11:14:32.08] #>
      [2015-01-24T11:14:32.09] #> SUMMARY: Following errors occured
      [2015-01-24T11:14:32.09] #> during test execution:
      [2015-01-24T11:14:32.09] #>
      [2015-01-24T11:14:32.09] # ERROR: Debuggee FAILED with exit code: 11
      [2015-01-24T11:14:32.09] # ERROR: TEST FAILED
      [2015-01-24T11:14:32.19] # Test level exit status: 97

        Attachments

          Issue Links

            Activity

              People

              Assignee:
              Unassigned Unassigned
              Reporter:
              dlong Dean Long
              Votes:
              0 Vote for this issue
              Watchers:
              2 Start watching this issue

                Dates

                Created:
                Updated:
                Resolved: