Uploaded image for project: 'JDK'
  1. JDK
  2. JDK-8073636

[linux-sparc][TESTBUG] Test java/awt/EventDispatchThread/LoopRobustness/LoopRobustness.html fails on Linux-Sparc64 only

    Details

    • Subcomponent:
    • CPU:
      sparc_64
    • OS:
      linux

      Description

      Testsuite name: Regression(j2se_java_gui)
      Test name: java/awt/EventDispatchThread/LoopRobustness/LoopRobustness.html
      Product(s) tested: JDK 7u80b08 (Linux-sparcv9)
      OS/architecture: Linux/Sparc64

      Error log file: see comments
      Reproducible: Always
      Reproducible on machine: slc08vnc.us.oracle.com, slc08vng.us.oracle.com
       
      Is it a Regression: No
      Regression introduced in release/build: N/A
      Test result on the last GAed release for this train: Fail (1.7.0_76b13)
      Test result on FCS: Linux-sparcv9 build is not present for 1.7.0b148

      Is it a platform specific issue: Yes(Passing in Linux(x64))
      [If platform specific issue] Is it a new (previously unsupported) OS/browser/mode testing: No
      [If new configuration testing] Issue specific to execution mode or OS/browser version: No

      Exception/Error from Log:
      ----------System.err:(13/819)----------
      java.lang.RuntimeException: Test FAILED: second thread hasn't notified MainThread
      at LoopRobustness.main(LoopRobustness.java:70)
      at sun.reflect.NativeMethodAccessorImpl.invoke0(Native Method)
      at sun.reflect.NativeMethodAccessorImpl.invoke(NativeMethodAccessorImpl.java:57)
      at sun.reflect.DelegatingMethodAccessorImpl.invoke(DelegatingMethodAccessorImpl.java:43)
      at java.lang.reflect.Method.invoke(Method.java:606)
      at com.sun.javatest.regtest.MainWrapper$MainThread.run(MainWrapper.java:94)
      at java.lang.Thread.run(Thread.java:745)

      JavaTest Message: Test threw exception: java.lang.RuntimeException: Test FAILED: second thread hasn't notified MainThread
      JavaTest Message: shutting down test

      STATUS:Failed.`main' threw exception: java.lang.RuntimeException: Test FAILED: second thread hasn't notified MainThread

      Test run log location:
      Steps to reproduce: see comments

        Attachments

          Activity

            People

            • Assignee:
              vagarwal Vikrant Agarwal
              Reporter:
              sgupta Shobhit Gupta
            • Votes:
              0 Vote for this issue
              Watchers:
              8 Start watching this issue

              Dates

              • Created:
                Updated:
                Resolved: