Uploaded image for project: 'JDK'
  1. JDK
  2. JDK-8079069

[macos] Test java/awt/Frame/FramesGC/FramesGC.java fails in Mac10.10 and passes in Mac10.9

    Details

    • Subcomponent:
    • CPU:
      generic
    • OS:
      os_x

      Description

      JDK tested: 9b60
      OS tested: Mac 10.10 , Mac10.9
      Is it a regression? NO
      Is it platform specific? Yes( Fails on Mac 10.10 and Passes on 10.9)
      The is failure reproduced: always
          
      General description:
      ----------System.err:(17/917)----------
      Platform doesn't support to create a custom cursor.
      Platform doesn't support to create a custom cursor.
      Platform doesn't support to create a custom cursor.
      java.lang.RuntimeException: Count = 1. Test failed!
      at FramesGC.doTest(FramesGC.java:86)
      at FramesGC.main(FramesGC.java:48)
      at sun.reflect.NativeMethodAccessorImpl.invoke0(Native Method)
      at sun.reflect.NativeMethodAccessorImpl.invoke(NativeMethodAccessorImpl.java:62)
      at sun.reflect.DelegatingMethodAccessorImpl.invoke(DelegatingMethodAccessorImpl.java:43)
      at java.lang.reflect.Method.invoke(Method.java:502)
      at com.sun.javatest.regtest.agent.MainWrapper$MainThread.run(MainWrapper.java:92)
      at java.lang.Thread.run(Thread.java:745)

      JavaTest Message: Test threw exception: java.lang.RuntimeException: Count = 1. Test failed!
      JavaTest Message: shutting down test

      STATUS:Failed.`main' threw exception: java.lang.RuntimeException: Count = 1. Test failed!

        Attachments

          Issue Links

            Activity

              People

              • Assignee:
                Unassigned
                Reporter:
                pchopra Pooja Chopra (Inactive)
              • Votes:
                0 Vote for this issue
                Watchers:
                4 Start watching this issue

                Dates

                • Created:
                  Updated: