Uploaded image for project: 'JDK'
  1. JDK
  2. JDK-8079758

java/rmi/activation/ActivationSystem tests fail intermittently with port already in use

    Details

      Description

      java/rmi/activation/Activatable/lookupActivationSystem/LookupActivationSystem.java fails intermittently.

      ----------System.err:(58/4432)----------
      RMID: Starting rmid on port 6161.
      JAVAVM: command = [/scratch/aurora/sandbox_keepme/jdk/bin/java, -ea, -esa, -Xmx512m, -Djava.security.policy=/scratch/aurora/sandbox_keepme/testbase/jdk/test/java/rmi/activation/Activatable/lookupActivationSystem/rmid.security.policy, -Dsun.rmi.server.activation.debugExec=true, -Dtest.src=/scratch/aurora/sandbox_keepme/testbase/jdk/test/java/rmi/activation/Activatable/lookupActivationSystem, -Dtest.classes=/scratch/aurora/sandbox_keepme/results/run_412/testoutput/tier2/JTwork/classes/5/java/rmi/activation/Activatable/lookupActivationSystem, -Djava.rmi.server.logLevel=v, -Dsun.rmi.activation.execTimeout=60000, sun.rmi.server.Activation, -log, /scratch/aurora/sandbox_keepme/results/run_412/testoutput/tier2/JTwork/scratch/5/./log, -port, 6161, -C-Dtest.src=/scratch/aurora/sandbox_keepme/testbase/jdk/test/java/rmi/activation/Activatable/lookupActivationSystem, -C-Dtest.classes=/scratch/aurora/sandbox_keepme/results/run_412/testoutput/tier2/JTwork/classes/5/java/rmi/activation/Activatable/lookupActivationSystem, -C-ea, -C-esa, -C-Xmx512m, -C-Djava.rmi.server.useCodebaseOnly=false]
      Activation.main: warning: sun.rmi.activation.execPolicy system
              property unspecified and no ExecPermissions/ExecOptionPermissions
              granted; subsequent activation attempts may fail due to unsuccessful
      ExecPermission/ExecOptionPermission permission checks. For
      documentation on how to configure rmid security, refer to:

              http://java.sun.com/j2se/1.4/docs/tooldocs/solaris/rmid.html
              http://java.sun.com/j2se/1.4/docs/tooldocs/win32/rmid.html

      Activation.main: an exception occurred: java.rmi.server.ExportException: Port already in use: 6161; nested exception is:
      java.net.BindException: Address already in use
      java.rmi.server.ExportException: Port already in use: 6161; nested exception is:
      java.net.BindException: Address already in use
      at sun.rmi.transport.tcp.TCPTransport.listen(TCPTransport.java:336)
      at sun.rmi.transport.tcp.TCPTransport.exportObject(TCPTransport.java:244)
      at sun.rmi.transport.tcp.TCPEndpoint.exportObject(TCPEndpoint.java:411)
      at sun.rmi.transport.LiveRef.exportObject(LiveRef.java:147)
      at sun.rmi.server.UnicastServerRef.exportObject(UnicastServerRef.java:206)
      at sun.rmi.server.Activation$ActivatorImpl.<init>(Activation.java:428)
      at sun.rmi.server.Activation.init(Activation.java:250)
      at sun.rmi.server.Activation.startActivation(Activation.java:219)
      at sun.rmi.server.Activation.main(Activation.java:2111)
      Caused by: java.net.BindException: Address already in use
      at java.net.PlainSocketImpl.socketBind(Native Method)
      at java.net.AbstractPlainSocketImpl.bind(AbstractPlainSocketImpl.java:382)
      at java.net.ServerSocket.bind(ServerSocket.java:376)
      at java.net.ServerSocket.<init>(ServerSocket.java:238)
      at java.net.ServerSocket.<init>(ServerSocket.java:130)
      at sun.rmi.transport.proxy.RMIDirectSocketFactory.createServerSocket(RMIDirectSocketFactory.java:45)
      at sun.rmi.transport.proxy.RMIMasterSocketFactory.createServerSocket(RMIMasterSocketFactory.java:341)
      at sun.rmi.transport.tcp.TCPEndpoint.newServerSocket(TCPEndpoint.java:666)
      at sun.rmi.transport.tcp.TCPTransport.listen(TCPTransport.java:325)
      ... 8 more
      TEST FAILED: Rmid process exited with status 1 after 367ms.
      RMID: shutdown()
      RMID: lookupSystem() returned null after 1ms.
      RMID: Destroying RMID process.
      RMID: Destroy successful after 1ms.
      RMID: Removing rmid's old log file.
      TestFailedException: TEST FAILED: Rmid process exited with status 1 after 367ms.
      at TestLibrary.bomb(TestLibrary.java:121)
      at TestLibrary.bomb(TestLibrary.java:124)
      at RMID.start(RMID.java:274)
      at RMID.start(RMID.java:237)
      at LookupActivationSystem.main(LookupActivationSystem.java:55)
      at sun.reflect.NativeMethodAccessorImpl.invoke0(Native Method)
      at sun.reflect.NativeMethodAccessorImpl.invoke(NativeMethodAccessorImpl.java:62)
      at sun.reflect.DelegatingMethodAccessorImpl.invoke(DelegatingMethodAccessorImpl.java:43)
      at java.lang.reflect.Method.invoke(Method.java:502)
      at com.sun.javatest.regtest.agent.MainWrapper$MainThread.run(MainWrapper.java:92)
      at java.lang.Thread.run(Thread.java:745)

      JavaTest Message: Test threw exception: TestFailedException: TEST FAILED: Rmid process exited with status 1 after 367ms.
      JavaTest Message: shutting down test

      STATUS:Failed.`main' threw exception: TestFailedException: TEST FAILED: Rmid process exited with status 1 after 367ms.

        Attachments

          Issue Links

            Activity

              People

              • Assignee:
                mli Hamlin Li
                Reporter:
                amlu Amy Lu
              • Votes:
                0 Vote for this issue
                Watchers:
                3 Start watching this issue

                Dates

                • Created:
                  Updated:
                  Resolved: