Uploaded image for project: 'JDK'
  1. JDK
  2. JDK-8080982

[TESTBUG] Test java/awt/datatransfer/DragImage/MultiResolutionDragImageTest.java fails

    XMLWordPrintable

    Details

    • Subcomponent:
    • CPU:
      generic
    • OS:
      generic

      Description

      Testsuite name: Regression(jdk_awt)
      Test name(s): java/awt/datatransfer/DragImage/MultiResolutionDragImageTest.java
      Product(s) tested: JDK 9b65(64-bit), JDK 8u60b14(64-bit)
      OS/architecture: Windows/x64, Linux/x64
      Reproducible: Always
      Reproducible on machine: spb23313.ru.oracle.com(Linux), spb23265.ru.oracle.com(Windows)
      Is it a Regression: No
      Regression introduced in release/build: N/A
      Is it a platform specific issue: No(fails on Windows, Linux and MacOSX)
      [If platform specific issue] Is it a new (previously unsupported) OS/browser/mode testing: No
      [If new configuration testing] Issue specific to execution mode or OS/browser version:No

      Exception/Error from Log:
      ----------System.out:(0/0)----------
      ----------System.err:(14/981)----------
      java.lang.RuntimeException: TEST FAILED: Image with wrong resolution is used for drag image!
      at MultiResolutionDragImageTest.testDrag(MultiResolutionDragImageTest.java:101)
      at MultiResolutionDragImageTest.main(MultiResolutionDragImageTest.java:55)
      at sun.reflect.NativeMethodAccessorImpl.invoke0(Native Method)
      at sun.reflect.NativeMethodAccessorImpl.invoke(NativeMethodAccessorImpl.java:62)
      at sun.reflect.DelegatingMethodAccessorImpl.invoke(DelegatingMethodAccessorImpl.java:43)
      at java.lang.reflect.Method.invoke(Method.java:497)
      at com.sun.javatest.regtest.agent.MainWrapper$MainThread.run(MainWrapper.java:92)
      at java.lang.Thread.run(Thread.java:745)

      JavaTest Message: Test threw exception: java.lang.RuntimeException: TEST FAILED: Image with wrong resolution is used for drag image!
      JavaTest Message: shutting down test

      STATUS:Failed.`main' threw exception: java.lang.RuntimeException: TEST FAILED: Image with wrong resolution is used for drag image!

      Test run log location: see comments

        Attachments

          Issue Links

            Activity

              People

              Assignee:
              azvegint Alexander Zvegintsev
              Reporter:
              sgupta Shobhit Gupta
              Votes:
              0 Vote for this issue
              Watchers:
              7 Start watching this issue

                Dates

                Created:
                Updated: