Uploaded image for project: 'JDK'
  1. JDK
  2. JDK-8094590

Mac: Intermittent build failures in task graphics:ccMacFontT2K

    Details

    • Type: Bug
    • Status: Resolved
    • Priority: P3
    • Resolution: Fixed
    • Affects Version/s: 8
    • Fix Version/s: 8u11
    • Component/s: javafx
    • Labels:

      Description

      There is another bug on a concurrent modification bug in this same module (RT-34437), but this problem has a different final cause listed in the error output as seen below:

      -----------------------------
      :graphics:ccMacFontT2K FAILED

      FAILURE: Build failed with an exception.

      * What went wrong:
      Execution failed for task ':graphics:ccMacFontT2K'.
      > Could not call NativeCompileTask.compile() on task ':graphics:ccMacFontT2K'

      * Try:
      Run with --stacktrace option to get the stack trace. Run with --info or --debug option to get more log output.

      BUILD FAILED
      -----------------------------

      Those error lines are accompanied by 4000 lines of error messages which are attached in a text file.

        Attachments

          Issue Links

            Activity

              People

              • Assignee:
                kcr Kevin Rushforth
                Reporter:
                flar Jim Graham
              • Votes:
                0 Vote for this issue
                Watchers:
                4 Start watching this issue

                Dates

                • Created:
                  Updated:
                  Resolved:
                  Imported: