Uploaded image for project: 'JDK'
  1. JDK
  2. JDK-8097343

Mac: Intermittent build failures when compiling T2K native code on Mac OS X

    Details

    • Type: Bug
    • Status: Closed
    • Priority: P4
    • Resolution: Cannot Reproduce
    • Affects Version/s: 8
    • Fix Version/s: None
    • Component/s: javafx
    • Labels:
      None

      Description

      We occasionally see a Hudson build failure on Mac when building the (closed) T2K library. The systems are running Mac OS X 10.7.5. The gradle build is getting the following exception. It will be interesting to see whether this still happens once we upgrade to gradle 1.8.

      -------------------------------------------------------------------------------
      :graphics:ccMacFontT2K FAILED

      FAILURE: Build failed with an exception.

      * What went wrong:
      Execution failed for task ':graphics:ccMacFontT2K'.
      > java.util.ConcurrentModificationException

      * Try:
      Run with --stacktrace option to get the stack trace. Run with --debug option to get more log output.

      BUILD FAILED

        Attachments

          Issue Links

            Activity

              People

              • Assignee:
                kcr Kevin Rushforth
                Reporter:
                kcr Kevin Rushforth
              • Votes:
                0 Vote for this issue
                Watchers:
                2 Start watching this issue

                Dates

                • Created:
                  Updated:
                  Resolved:
                  Imported: