Uploaded image for project: 'JDK'
  1. JDK
  2. JDK-8119384

Fix for RT-15120 broke unit tests

    XMLWordPrintable

    Details

    • Type: Bug
    • Status: Closed
    • Priority: P2
    • Resolution: Fixed
    • Affects Version/s: fx2.0.2
    • Fix Version/s: fx2.0.2
    • Component/s: javafx
    • Labels:

      Description

      http://jfx.us.oracle.com/hudson/job/2.0.2-graphics-smoketest/6/label=windows-i586-14/console

         [junit] Testsuite: javafx.scene.input.DataFormatTest
         [junit] Tests run: 28, Failures: 8, Errors: 0, Time elapsed: 0.359 sec
         [junit] [junit] Testcase: testMimeTypes[0](javafx.scene.input.DataFormatTest): FAILED
         [junit] expected:<2> but was:<1>
         [junit] junit.framework.AssertionFailedError: expected:<2> but was:<1>
         [junit] at javafx.scene.input.DataFormatTest.testMimeTypes(DataFormatTest.java:45)
         [junit] [junit] [junit] Testcase: dataFormatsShouldBeFound[0](javafx.scene.input.DataFormatTest): FAILED
         [junit] expected same:<[text/plain]> was not:<null>
         [junit] junit.framework.AssertionFailedError: expected same:<[text/plain]> was not:<null>
         [junit] at javafx.scene.input.DataFormatTest.dataFormatsShouldBeFound(DataFormatTest.java:56)
         [junit] [junit] [junit] Testcase: testMimeTypes[1](javafx.scene.input.DataFormatTest): FAILED
         [junit] expected:<2> but was:<1>
         [junit] junit.framework.AssertionFailedError: expected:<2> but was:<1>
         [junit] at javafx.scene.input.DataFormatTest.testMimeTypes(DataFormatTest.java:45)
         [junit] [junit] [junit] Testcase: dataFormatsShouldBeFound[1](javafx.scene.input.DataFormatTest): FAILED
         [junit] expected same:<[text/html]> was not:<null>
         [junit] junit.framework.AssertionFailedError: expected same:<[text/html]> was not:<null>
         [junit] at javafx.scene.input.DataFormatTest.dataFormatsShouldBeFound(DataFormatTest.java:56)
         [junit] [junit] [junit] Testcase: testMimeTypes[2](javafx.scene.input.DataFormatTest): FAILED
         [junit] expected:<2> but was:<1>
         [junit] junit.framework.AssertionFailedError: expected:<2> but was:<1>
         [junit] at javafx.scene.input.DataFormatTest.testMimeTypes(DataFormatTest.java:45)
         [junit] [junit] [junit] Testcase: dataFormatsShouldBeFound[2](javafx.scene.input.DataFormatTest): FAILED
         [junit] expected same:<[text/rtf]> was not:<null>
         [junit] junit.framework.AssertionFailedError: expected same:<[text/rtf]> was not:<null>
         [junit] at javafx.scene.input.DataFormatTest.dataFormatsShouldBeFound(DataFormatTest.java:56)
         [junit] [junit] [junit] Testcase: testMimeTypes[3](javafx.scene.input.DataFormatTest): FAILED
         [junit] expected:<2> but was:<1>
         [junit] junit.framework.AssertionFailedError: expected:<2> but was:<1>
         [junit] at javafx.scene.input.DataFormatTest.testMimeTypes(DataFormatTest.java:45)
         [junit] [junit] [junit] Testcase: dataFormatsShouldBeFound[3](javafx.scene.input.DataFormatTest): FAILED
         [junit] expected same:<[text/uri-list]> was not:<null>
         [junit] junit.framework.AssertionFailedError: expected same:<[text/uri-list]> was not:<null>
         [junit] at javafx.scene.input.DataFormatTest.dataFormatsShouldBeFound(DataFormatTest.java:56)
         [junit] [junit] [junit] Test javafx.scene.input.DataFormatTest FAILED

        Attachments

          Activity

            People

            Assignee:
            psafrata Pavel Ĺ afrata
            Reporter:
            kcr Kevin Rushforth
            Votes:
            0 Vote for this issue
            Watchers:
            0 Start watching this issue

              Dates

              Created:
              Updated:
              Resolved:
              Imported: