Uploaded image for project: 'JDK'
  1. JDK
  2. JDK-8132658

[Regression] Test closed/sun/awt/font/Bidi/BidiTests.java fails

    XMLWordPrintable

    Details

    • Subcomponent:
    • Introduced In Build:
      b74
    • Introduced In Version:
      9
    • Resolved In Build:
      b82
    • CPU:
      other
    • OS:
      generic

      Backports

        Description

        Test name(s):closed/sun/awt/font/Bidi/BidiTests.java

        JDK tested: 9b74, 9b73
        OS tested: Windows, MacOSX
        Is it a regression? Yes( fails in 9b74)
        Regression introduced in release/build:9b74
        Is it platform specific? No
        The is failure reproduced: always
                   
        General description:

        ----------System.err:(13/697)----------
        java.lang.Exception: Bidi test failed
        at BidiTests.main(BidiTests.java:228)
        at sun.reflect.NativeMethodAccessorImpl.invoke0(Native Method)
        at sun.reflect.NativeMethodAccessorImpl.invoke(NativeMethodAccessorImpl.java:62)
        at sun.reflect.DelegatingMethodAccessorImpl.invoke(DelegatingMethodAccessorImpl.java:43)
        at java.lang.reflect.Method.invoke(Method.java:504)
        at com.sun.javatest.regtest.agent.MainWrapper$MainThread.run(MainWrapper.java:92)
        at java.lang.Thread.run(Thread.java:746)

        JavaTest Message: Test threw exception: java.lang.Exception: Bidi test failed
        JavaTest Message: shutting down test

        STATUS:Failed.`main' threw exception: java.lang.Exception: Bidi test failed

          Attachments

            Issue Links

              Activity

                People

                Assignee:
                peytoia Yuka Kamiya (Inactive)
                Reporter:
                pchopra Pooja Chopra (Inactive)
                Votes:
                0 Vote for this issue
                Watchers:
                6 Start watching this issue

                  Dates

                  Created:
                  Updated:
                  Resolved: