Uploaded image for project: 'JDK'
  1. JDK
  2. JDK-8136996

Dev branch build failure

    XMLWordPrintable

    Details

    • Type: Bug
    • Status: Resolved
    • Priority: P4
    • Resolution: Fixed
    • Affects Version/s: None
    • Fix Version/s: None
    • Component/s: embedded
    • Labels:
      None
    • Subcomponent:
      dio

      Description

      Caused by previous commit
      Compiling src/se/native/com/oracle/dio/dio_event_queue.cpp
      src/se/native/com/oracle/dio/dio_event_queue.cpp: In function 'void event_queue_put_native_event(JavaVM*, const char*, const char*, int)':
      src/se/native/com/oracle/dio/dio_event_queue.cpp:53:31: error: 'JC_DIO' was not declared in this scope
      src/se/native/com/oracle/dio/dio_event_queue.cpp:53:80: error: 'JAVACALL_REPORT_ERROR' was not declared in this scope
      make: *** [dio_event_queue.o] Error 1
      Build step 'Execute shell' marked build as failure
      Archiving artifacts

        Attachments

          Activity

            People

            Assignee:
            snazarki Sergey Nazarkin
            Reporter:
            snazarki Sergey Nazarkin
            Votes:
            0 Vote for this issue
            Watchers:
            1 Start watching this issue

              Dates

              Created:
              Updated:
              Resolved: