Uploaded image for project: 'JDK'
  1. JDK
  2. JDK-8145138

CyclicBarrier/Basic.java failed with "3 not equal to 4"

    Details

      Description

      ----------System.out:(8/60)----------
      OK!
      OK!
      OK!
      OK!
      3 not equal to 4

      Passed = 310, failed = 1

      ----------System.err:(27/1370)----------
      Stack trace
      at java.lang.Thread.dumpStack(Thread.java:1334)
      at Basic.fail(Basic.java:414)
      at Basic.fail(Basic.java:415)
      at Basic.equal(Basic.java:420)
      at Basic.testInterrupts(Basic.java:403)
      at Basic.realMain(Basic.java:287)
      at Basic.main(Basic.java:422)
      at sun.reflect.NativeMethodAccessorImpl.invoke0(Native Method)
      at sun.reflect.NativeMethodAccessorImpl.invoke(NativeMethodAccessorImpl.java:62)
      at sun.reflect.DelegatingMethodAccessorImpl.invoke(DelegatingMethodAccessorImpl.java:43)
      at java.lang.reflect.Method.invoke(Method.java:520)
      at com.sun.javatest.regtest.agent.MainWrapper$MainThread.run(MainWrapper.java:92)
      at java.lang.Thread.run(Thread.java:747)
      java.lang.AssertionError: Some tests failed
      at Basic.main(Basic.java:424)
      at sun.reflect.NativeMethodAccessorImpl.invoke0(Native Method)
      at sun.reflect.NativeMethodAccessorImpl.invoke(NativeMethodAccessorImpl.java:62)
      at sun.reflect.DelegatingMethodAccessorImpl.invoke(DelegatingMethodAccessorImpl.java:43)
      at java.lang.reflect.Method.invoke(Method.java:520)
      at com.sun.javatest.regtest.agent.MainWrapper$MainThread.run(MainWrapper.java:92)
      at java.lang.Thread.run(Thread.java:747)

      JavaTest Message: Test threw exception: java.lang.AssertionError: Some tests failed
      JavaTest Message: shutting down test

      STATUS:Failed.`main' threw exception: java.lang.AssertionError: Some tests failed

        Attachments

          Issue Links

            Activity

              People

              • Assignee:
                martin Martin Buchholz
                Reporter:
                gziemski Gerard Ziemski
              • Votes:
                0 Vote for this issue
                Watchers:
                1 Start watching this issue

                Dates

                • Created:
                  Updated: