Uploaded image for project: 'JDK'
  1. JDK
  2. JDK-8145413

MissingClassTest failed with TEST FAILS: Timed out without receiving all notifs: known=42; lost=83

    XMLWordPrintable

    Details

      Description

      ----------System.err:(289/28120)----------
      Dec 15, 2015 8:07:34 AM ClientNotifForwarder NotifFetcher.fetchOneNotif
      WARNING: Failed to deserialize a notification: java.rmi.UnmarshalException: error unmarshalling return; nested exception is:
      java.io.WriteAbortedException: writing aborted; java.io.NotSerializableException: java.lang.Thread

        Attachments

          Activity

            People

            Assignee:
            Unassigned Unassigned
            Reporter:
            gziemski Gerard Ziemski
            Votes:
            0 Vote for this issue
            Watchers:
            3 Start watching this issue

              Dates

              Created:
              Updated: