Uploaded image for project: 'JDK'
  1. JDK
  2. JDK-8145637

[linux-sparc] Test java/util/Arrays/FloatDoubleOrder.java fails for linux sparc

    Details

      Description

      Testsuite name: j2se_java_rest
      Test name(s): java/util/Arrays/FloatDoubleOrder.java
      Product(s) tested: JDK 7 u80 b15
      OS/architecture: Linux Sparc 64 bit -Xcomp


      Reproducible: Always


      Is it a Regression: No (Test passed for JDK 7 u80 b15 on Linux amd64 Oracle Linux 6.4 )

      Is it a platform specific issue: Yes (Test passed for JDK 7 u80 b15 on Linux amd64 Oracle Linux 6.4 )
      [If platform specific issue] Is it a new (previously unsupported) OS/browser/mode testing: Yes ( Linux Sparc )
      [If new configuration testing] Issue specific to execution mode or OS/browser version:

      Exception/Error from Log:

      ----------System.err:(0/0)----------
      result: Passed. Compilation successful

      #section:main
      ----------messages:(3/132)----------
      command: main FloatDoubleOrder
      reason: Assumed action based on file name: run main FloatDoubleOrder
      elapsed time (seconds): 15.982
      ----------System.out:(3/26)----------

      Passed = 23, failed = 1

      ----------System.err:(27/1547)----------
      java.lang.Exception: Stack trace
      at java.lang.Thread.dumpStack(Thread.java:1365)
      at FloatDoubleOrder.fail(FloatDoubleOrder.java:110)
      at FloatDoubleOrder.check(FloatDoubleOrder.java:113)
      at FloatDoubleOrder.test(FloatDoubleOrder.java:104)
      at FloatDoubleOrder.instanceMain(FloatDoubleOrder.java:120)
      at FloatDoubleOrder.main(FloatDoubleOrder.java:118)
      at sun.reflect.NativeMethodAccessorImpl.invoke0(Native Method)
      at sun.reflect.NativeMethodAccessorImpl.invoke(NativeMethodAccessorImpl.java:57)
      at sun.reflect.DelegatingMethodAccessorImpl.invoke(DelegatingMethodAccessorImpl.java:43)
      at java.lang.reflect.Method.invoke(Method.java:606)
      at com.sun.javatest.regtest.agent.MainWrapper$MainThread.run(MainWrapper.java:92)
      at java.lang.Thread.run(Thread.java:745)
      java.lang.AssertionError: Some tests failed
      at FloatDoubleOrder.instanceMain(FloatDoubleOrder.java:122)
      at FloatDoubleOrder.main(FloatDoubleOrder.java:118)
      at sun.reflect.NativeMethodAccessorImpl.invoke0(Native Method)
      at sun.reflect.NativeMethodAccessorImpl.invoke(NativeMethodAccessorImpl.java:57)
      at sun.reflect.DelegatingMethodAccessorImpl.invoke(DelegatingMethodAccessorImpl.java:43)
      at java.lang.reflect.Method.invoke(Method.java:606)
      at com.sun.javatest.regtest.agent.MainWrapper$MainThread.run(MainWrapper.java:92)
      at java.lang.Thread.run(Thread.java:745)

      JavaTest Message: Test threw exception: java.lang.AssertionError: Some tests failed
      JavaTest Message: shutting down test

      STATUS:Failed.`main' threw exception: java.lang.AssertionError: Some tests failed

        Attachments

          Activity

            People

            • Assignee:
              bpb Brian Burkhalter
              Reporter:
              vagarwal Vikrant Agarwal
            • Votes:
              0 Vote for this issue
              Watchers:
              4 Start watching this issue

              Dates

              • Created:
                Updated:
                Resolved: