Uploaded image for project: 'JDK'
  1. JDK
  2. JDK-8145646

[linux-sparc] Test javax/swing/JSlider/6794831/bug6794831.java fails for linux sparc

    Details

      Description

      Testsuite name: j2se_javax_gui
      Test name(s): javax/swing/JSlider/6794831/bug6794831.java
      Product(s) tested: JDK 7 u80 b15
      OS/architecture: Linux Sparc 64 bit -Xcomp


      Reproducible: Always


      Is it a Regression: No (Test passed for JDK 7 u80 b15 on Linux amd64 Oracle Linux 6.4 )

      Is it a platform specific issue: Yes (Test passed for JDK 7 u80 b15 on Linux amd64 Oracle Linux 6.4 )
      [If platform specific issue] Is it a new (previously unsupported) OS/browser/mode testing: Yes ( Linux Sparc )
      [If new configuration testing] Issue specific to execution mode or OS/browser version:

      Exception/Error from Log:

      ----------System.err:(15/789)----------
      java.lang.RuntimeException: bug6794831 failed
      at bug6794831.fail(bug6794831.java:103)
      at bug6794831.run(bug6794831.java:98)
      at bug6794831.main(bug6794831.java:41)
      at sun.reflect.NativeMethodAccessorImpl.invoke0(Native Method)
      at sun.reflect.NativeMethodAccessorImpl.invoke(NativeMethodAccessorImpl.java:57)
      at sun.reflect.DelegatingMethodAccessorImpl.invoke(DelegatingMethodAccessorImpl.java:43)
      at java.lang.reflect.Method.invoke(Method.java:606)
      at com.sun.javatest.regtest.agent.MainWrapper$MainThread.run(MainWrapper.java:92)
      at java.lang.Thread.run(Thread.java:745)

      JavaTest Message: Test threw exception: java.lang.RuntimeException: bug6794831 failed
      JavaTest Message: shutting down test

      STATUS:Failed.`main' threw exception: java.lang.RuntimeException: bug6794831 failed

        Attachments

          Activity

            People

            • Assignee:
              scfitch Stephen Fitch
              Reporter:
              vagarwal Vikrant Agarwal
            • Votes:
              0 Vote for this issue
              Watchers:
              3 Start watching this issue

              Dates

              • Created:
                Updated:
                Resolved: