Uploaded image for project: 'JDK'
  1. JDK
  2. JDK-8145654

[linux-sparc] Test java/awt/EventQueue/SecondaryLoopTest/SecondaryLoopTest.java fails for linux sparc

    Details

      Description

      Testsuite name: j2se_java_gui
      Test name(s): java/awt/EventQueue/SecondaryLoopTest/SecondaryLoopTest.java
      Product(s) tested: JDK 7 u80 b15
      OS/architecture: Linux Sparc 64 bit -Xcomp


      Reproducible: Always


      Is it a Regression: No (Test passed for JDK 7 u80 b15 on Linux amd64 Oracle Linux 6.4 )

      Is it a platform specific issue: Yes (Test passed for JDK 7 u80 b15 on Linux amd64 Oracle Linux 6.4 )
      [If platform specific issue] Is it a new (previously unsupported) OS/browser/mode testing: Yes ( Linux Sparc )
      [If new configuration testing] Issue specific to execution mode or OS/browser version:

      Exception/Error from Log:

      ----------System.err:(14/877)----------
      java.lang.RuntimeException: Test FAILED: the secondary loop exited immediately
      at SecondaryLoopTest.test(SecondaryLoopTest.java:114)
      at SecondaryLoopTest.main(SecondaryLoopTest.java:47)
      at sun.reflect.NativeMethodAccessorImpl.invoke0(Native Method)
      at sun.reflect.NativeMethodAccessorImpl.invoke(NativeMethodAccessorImpl.java:57)
      at sun.reflect.DelegatingMethodAccessorImpl.invoke(DelegatingMethodAccessorImpl.java:43)
      at java.lang.reflect.Method.invoke(Method.java:606)
      at com.sun.javatest.regtest.agent.MainWrapper$MainThread.run(MainWrapper.java:92)
      at java.lang.Thread.run(Thread.java:745)

      JavaTest Message: Test threw exception: java.lang.RuntimeException: Test FAILED: the secondary loop exited immediately
      JavaTest Message: shutting down test

      STATUS:Failed.`main' threw exception: java.lang.RuntimeException: Test FAILED: the secondary loop exited immediately

        Attachments

          Activity

            People

            • Assignee:
              scfitch Stephen Fitch
              Reporter:
              vagarwal Vikrant Agarwal
            • Votes:
              0 Vote for this issue
              Watchers:
              3 Start watching this issue

              Dates

              • Created:
                Updated:
                Resolved: