Uploaded image for project: 'JDK'
  1. JDK
  2. JDK-8158756

[Testbug] serviceability/dcmd/compiler/CompilerQueueTest.java fails with TieredStopAtLevel=1

    Details

    • Type: Bug
    • Status: Resolved
    • Priority: P5
    • Resolution: Fixed
    • Affects Version/s: 9
    • Fix Version/s: 9
    • Component/s: hotspot
    • Labels:
    • Subcomponent:
    • Resolved In Build:
      b131

      Description

      jdk9 VM PIT (32-bit platforms only)
      #section:testng
      ----------messages:(4/367)----------
      command: testng -Xbootclasspath/a:. -XX:+UnlockDiagnosticVMOptions -Xmixed -XX:-TieredCompilation -XX:+WhiteBoxAPI CompilerQueueTest
      reason: User specified action: run testng/othervm -Xbootclasspath/a:. -XX:+UnlockDiagnosticVMOptions -Xmixed -XX:-TieredCompilation -XX:+WhiteBoxAPI CompilerQueueTest
      Mode: othervm [/othervm specified]
      elapsed time (seconds): 11.804
      ----------configuration:(5/219)----------
      Boot Layer
        add exports: java.base/jdk.internal.misc ALL-UNNAMED
                                  jdk.jvmstat/sun.jvmstat.monitor ALL-UNNAMED
        boot class path (append): .

      ----------System.out:(46/2867)----------
      [TestNG] Running:
        serviceability/dcmd/compiler/CompilerQueueTest.java

      test CompilerQueueTest.jmx(): failure
      java.lang.AssertionError: expected [true] but found [false]
      at org.testng.Assert.fail(Assert.java:94)
      at org.testng.Assert.failNotEquals(Assert.java:494)
      at org.testng.Assert.assertTrue(Assert.java:42)
      at org.testng.Assert.assertTrue(Assert.java:52)
      at CompilerQueueTest.run(CompilerQueueTest.java:110)
      at CompilerQueueTest.jmx(CompilerQueueTest.java:147)
      at jdk.internal.reflect.NativeMethodAccessorImpl.invoke0(java.base@9-internal/Native Method)
      at jdk.internal.reflect.NativeMethodAccessorImpl.invoke(java.base@9-internal/NativeMethodAccessorImpl.java:62)
      at jdk.internal.reflect.DelegatingMethodAccessorImpl.invoke(java.base@9-internal/DelegatingMethodAccessorImpl.java:43)
      at java.lang.reflect.Method.invoke(java.base@9-internal/Method.java:531)
      at org.testng.internal.MethodInvocationHelper.invokeMethod(MethodInvocationHelper.java:84)
      at org.testng.internal.Invoker.invokeMethod(Invoker.java:714)
      at org.testng.internal.Invoker.invokeTestMethod(Invoker.java:901)
      at org.testng.internal.Invoker.invokeTestMethods(Invoker.java:1231)
      at org.testng.internal.TestMethodWorker.invokeTestMethods(TestMethodWorker.java:127)
      at org.testng.internal.TestMethodWorker.run(TestMethodWorker.java:111)
      at org.testng.TestRunner.privateRun(TestRunner.java:767)
      at org.testng.TestRunner.run(TestRunner.java:617)
      at org.testng.SuiteRunner.runTest(SuiteRunner.java:334)
      at org.testng.SuiteRunner.runSequentially(SuiteRunner.java:329)
      at org.testng.SuiteRunner.privateRun(SuiteRunner.java:291)
      at org.testng.SuiteRunner.run(SuiteRunner.java:240)
      at org.testng.SuiteRunnerWorker.runSuite(SuiteRunnerWorker.java:52)
      at org.testng.SuiteRunnerWorker.run(SuiteRunnerWorker.java:86)
      at org.testng.TestNG.runSuitesSequentially(TestNG.java:1224)
      at org.testng.TestNG.runSuitesLocally(TestNG.java:1149)
      at org.testng.TestNG.run(TestNG.java:1057)
      at com.sun.javatest.regtest.TestNGAction$TestNGRunner.main(TestNGAction.java:220)
      at com.sun.javatest.regtest.TestNGAction$TestNGRunner.main(TestNGAction.java:184)
      at jdk.internal.reflect.NativeMethodAccessorImpl.invoke0(java.base@9-internal/Native Method)
      at jdk.internal.reflect.NativeMethodAccessorImpl.invoke(java.base@9-internal/NativeMethodAccessorImpl.java:62)
      at jdk.internal.reflect.DelegatingMethodAccessorImpl.invoke(java.base@9-internal/DelegatingMethodAccessorImpl.java:43)
      at java.lang.reflect.Method.invoke(java.base@9-internal/Method.java:531)
      at com.sun.javatest.regtest.agent.MainWrapper$MainThread.run(MainWrapper.java:110)
      at java.lang.Thread.run(java.base@9-internal/Thread.java:843)

      ===============================================
      serviceability/dcmd/compiler/CompilerQueueTest.java
      Total tests run: 1, Failures: 1, Skips: 0
      ===============================================

      ----------System.err:(14/929)----------
      java.lang.Exception: failures: 1
      at com.sun.javatest.regtest.TestNGAction$TestNGRunner.main(TestNGAction.java:223)
      at com.sun.javatest.regtest.TestNGAction$TestNGRunner.main(TestNGAction.java:184)
      at jdk.internal.reflect.NativeMethodAccessorImpl.invoke0(java.base@9-internal/Native Method)
      at jdk.internal.reflect.NativeMethodAccessorImpl.invoke(java.base@9-internal/NativeMethodAccessorImpl.java:62)
      at jdk.internal.reflect.DelegatingMethodAccessorImpl.invoke(java.base@9-internal/DelegatingMethodAccessorImpl.java:43)
      at java.lang.reflect.Method.invoke(java.base@9-internal/Method.java:531)
      at com.sun.javatest.regtest.agent.MainWrapper$MainThread.run(MainWrapper.java:110)
      at java.lang.Thread.run(java.base@9-internal/Thread.java:843)

      JavaTest Message: Test threw exception: java.lang.Exception: failures: 1
      JavaTest Message: shutting down test

      STATUS:Failed.`main' threw exception: java.lang.Exception: failures: 1

        Attachments

          Issue Links

          There are no Sub-Tasks for this issue.

            Activity

              People

              • Assignee:
                dpochepk Dmitrij Pochepko
                Reporter:
                dfazunen Dmitry Fazunenko (Inactive)
              • Votes:
                0 Vote for this issue
                Watchers:
                6 Start watching this issue

                Dates

                • Created:
                  Updated:
                  Resolved: