Uploaded image for project: 'JDK'
  1. JDK
  2. JDK-8161193

JShell tests: jdk/jshell/ComputeFQNsTest.java fails in AssertionError

    Details

    • Subcomponent:
    • OS:
      os_x

      Description

      STDOUT:
      [TestNG] Running:
        jdk/jshell/ComputeFQNsTest.java

      config KullaTesting.setUp(): success
      test ComputeFQNsTest.testAddImport(): success
      config KullaTesting.tearDown(): success
      config KullaTesting.setUp(): success
      test ComputeFQNsTest.testSuspendIndexing(): failure
      java.lang.AssertionError: Input: FQNTest, candidates=[]: lists don't have the same size expected [1] but found [0]
      at org.testng.Assert.fail(Assert.java:94)
      at org.testng.Assert.failNotEquals(Assert.java:494)
      at org.testng.Assert.assertEquals(Assert.java:123)
      at org.testng.Assert.assertEquals(Assert.java:370)
      at org.testng.Assert.assertEquals(Assert.java:537)
      at ComputeFQNsTest.testSuspendIndexing(ComputeFQNsTest.java:138)
      at jdk.internal.reflect.NativeMethodAccessorImpl.invoke0(java.base@9-internal/Native Method)
      at jdk.internal.reflect.NativeMethodAccessorImpl.invoke(java.base@9-internal/NativeMethodAccessorImpl.java:62)
      at jdk.internal.reflect.DelegatingMethodAccessorImpl.invoke(java.base@9-internal/DelegatingMethodAccessorImpl.java:43)
      at java.lang.reflect.Method.invoke(java.base@9-internal/Method.java:533)
      at org.testng.internal.MethodInvocationHelper.invokeMethod(MethodInvocationHelper.java:84)
      at org.testng.internal.Invoker.invokeMethod(Invoker.java:714)
      at org.testng.internal.Invoker.invokeTestMethod(Invoker.java:901)
      at org.testng.internal.Invoker.invokeTestMethods(Invoker.java:1231)
      at org.testng.internal.TestMethodWorker.invokeTestMethods(TestMethodWorker.java:127)
      at org.testng.internal.TestMethodWorker.run(TestMethodWorker.java:111)
      at org.testng.TestRunner.privateRun(TestRunner.java:767)
      at org.testng.TestRunner.run(TestRunner.java:617)
      at org.testng.SuiteRunner.runTest(SuiteRunner.java:334)
      at org.testng.SuiteRunner.runSequentially(SuiteRunner.java:329)
      at org.testng.SuiteRunner.privateRun(SuiteRunner.java:291)
      at org.testng.SuiteRunner.run(SuiteRunner.java:240)
      at org.testng.SuiteRunnerWorker.runSuite(SuiteRunnerWorker.java:52)
      at org.testng.SuiteRunnerWorker.run(SuiteRunnerWorker.java:86)
      at org.testng.TestNG.runSuitesSequentially(TestNG.java:1224)
      at org.testng.TestNG.runSuitesLocally(TestNG.java:1149)
      at org.testng.TestNG.run(TestNG.java:1057)
      at com.sun.javatest.regtest.TestNGAction$TestNGRunner.main(TestNGAction.java:220)
      at jdk.internal.reflect.NativeMethodAccessorImpl.invoke0(java.base@9-internal/Native Method)
      at jdk.internal.reflect.NativeMethodAccessorImpl.invoke(java.base@9-internal/NativeMethodAccessorImpl.java:62)
      at jdk.internal.reflect.DelegatingMethodAccessorImpl.invoke(java.base@9-internal/DelegatingMethodAccessorImpl.java:43)
      at java.lang.reflect.Method.invoke(java.base@9-internal/Method.java:533)
      at com.sun.javatest.regtest.agent.MainActionHelper$SameVMRunnable.run(MainActionHelper.java:226)
      at java.lang.Thread.run(java.base@9-internal/Thread.java:843)
      config KullaTesting.tearDown(): success

      ===============================================
      jdk/jshell/ComputeFQNsTest.java
      Total tests run: 2, Failures: 1, Skips: 0
      ===============================================

      STDERR:
      java.lang.Exception: failures: 1
      at com.sun.javatest.regtest.TestNGAction$TestNGRunner.main(TestNGAction.java:223)
      at jdk.internal.reflect.NativeMethodAccessorImpl.invoke0(java.base@9-internal/Native Method)
      at jdk.internal.reflect.NativeMethodAccessorImpl.invoke(java.base@9-internal/NativeMethodAccessorImpl.java:62)
      at jdk.internal.reflect.DelegatingMethodAccessorImpl.invoke(java.base@9-internal/DelegatingMethodAccessorImpl.java:43)
      at java.lang.reflect.Method.invoke(java.base@9-internal/Method.java:533)
      at com.sun.javatest.regtest.agent.MainActionHelper$SameVMRunnable.run(MainActionHelper.java:226)
      at java.lang.Thread.run(java.base@9-internal/Thread.java:843)

      JavaTest Message: Test threw exception: java.lang.Exception
      JavaTest Message: shutting down test

        Attachments

          Issue Links

            Activity

              People

              • Assignee:
                jlahoda Jan Lahoda
                Reporter:
                dfuchs Daniel Fuchs
              • Votes:
                0 Vote for this issue
                Watchers:
                2 Start watching this issue

                Dates

                • Created:
                  Updated: