Uploaded image for project: 'JDK'
  1. JDK
  2. JDK-8164473

[TEST_BUG] Series of modal/focus tests fail always on Unity

    XMLWordPrintable

    Details

    • Type: Bug
    • Status: Open
    • Priority: P4
    • Resolution: Unresolved
    • Affects Version/s: 9, 11
    • Fix Version/s: tbd
    • Component/s: client-libs
    • Environment:

      Ubuntu 16.04 Unity, dual-screen

    • Subcomponent:
    • OS:
      linux_ubuntu

      Description

      This group of tests always fail for me on Ubuntu 16.04 x64, Unity, should I say dual-screen setup.

      I'm not sure if it is a test or product issue. Some evaluation required. All I could say is, at least some of the tests do pass well with b111 but consistently fail since b122 on this system. So there somewhere _may_ be regression. Please let's work together if more information would be necessary.

      RULE "java/awt/Focus/ModalExcludedWindowClickTest/ModalExcludedWindowClickTest" Exception java.lang.RuntimeException: Test failed!

      RULE "java/awt/Modal/ModalFocusTransferTests/FocusTransferDialogsDocModalTest.java" Exception java.lang.RuntimeException: dialog Open button did not gain focus: expected true, was false

      RULE "java/awt/Modal/ModalFocusTransferTests/FocusTransferDialogsModelessTest.java" Exception java.lang.RuntimeException: dialog Open button did not gain focus: expected true, was false

      RULE "java/awt/Modal/ModalFocusTransferTests/FocusTransferDialogsNonModalTest.java" Exception java.lang.RuntimeException: dialog Open button did not gain focus: expected true, was false

        Attachments

          Issue Links

            Activity

              People

              Assignee:
              azvegint Alexander Zvegintsev
              Reporter:
              yan Yuri Nesterenko
              Votes:
              0 Vote for this issue
              Watchers:
              5 Start watching this issue

                Dates

                Created:
                Updated: