Uploaded image for project: 'JDK'
  1. JDK
  2. JDK-8167171

sun/tools/jhsdb/heapconfig/JMapHeapConfigTest.java failed with "jmap exits with non zero exit code 6"

    XMLWordPrintable

    Details

    • Type: Bug
    • Status: Closed
    • Priority: P4
    • Resolution: Duplicate
    • Affects Version/s: 9
    • Fix Version/s: None
    • Component/s: hotspot
    • Labels:
    • Subcomponent:
      svc

      Description

      Test: sun/tools/jhsdb/heapconfig/JMapHeapConfigTest.java

      Platform: SunOS 5.12 (sparcv9)

      Log:
      Phoning home...
      Using server: X.X.X.X., port xxxx
      java.lang.RuntimeException: Test FAILED jmap exits with non zero exit code 6
      at JMapHeapConfigTest.main(JMapHeapConfigTest.java:155)
      at jdk.internal.reflect.NativeMethodAccessorImpl.invoke0(java.base@9-ea/Native Method)
      at jdk.internal.reflect.NativeMethodAccessorImpl.invoke(java.base@9-ea/NativeMethodAccessorImpl.java:62)
      at jdk.internal.reflect.DelegatingMethodAccessorImpl.invoke(java.base@9-ea/DelegatingMethodAccessorImpl.java:43)
      at java.lang.reflect.Method.invoke(java.base@9-ea/Method.java:535)
      at com.sun.javatest.regtest.agent.MainWrapper$MainThread.run(MainWrapper.java:110)
      at java.lang.Thread.run(java.base@9-ea/Thread.java:843)

      JavaTest Message: Test threw exception: java.lang.RuntimeException: Test FAILED jmap exits with non zero exit code 6
      JavaTest Message: shutting down test

      STATUS:Failed.`main' threw exception: java.lang.RuntimeException: Test FAILED jmap exits with non zero exit code 6
      ----------rerun:(31/2838)*----------

        Attachments

          Issue Links

            Activity

              People

              • Assignee:
                Unassigned
                Reporter:
                ssahoo Sibabrata Sahoo
              • Votes:
                0 Vote for this issue
                Watchers:
                1 Start watching this issue

                Dates

                • Created:
                  Updated:
                  Resolved: