Uploaded image for project: 'JDK'
  1. JDK
  2. JDK-8171413

jdk/javadoc/doclet/testModules/TestModules.java failed due to some subtests failed

    Details

    • Subcomponent:
    • Resolved In Build:
      b150
    • Verification:
      Verified

      Description

      ----------System.err:(18/1156)----------
      java.nio.file.NoSuchFileException: out-nomodule/testpkgmdlA/package-summary.html
      java.nio.file.NoSuchFileException: out-nomodule/testpkgmdlA/TestClassInModuleA.html
      java.nio.file.NoSuchFileException: out-html5-nomodule/testpkgmdlA/package-summary.html
      java.nio.file.NoSuchFileException: out-html5-nomodule/testpkgmdlA/TestClassInModuleA.html
      java.lang.Error: 2 of 246 subtests failed, in 13 runs of javadoc
      at JavadocTester.printSummary(JavadocTester.java:667)
      at JavadocTester.runTests(JavadocTester.java:253)
      at TestModules.main(TestModules.java:38)
      at java.base/jdk.internal.reflect.NativeMethodAccessorImpl.invoke0(Native Method)
      at java.base/jdk.internal.reflect.NativeMethodAccessorImpl.invoke(NativeMethodAccessorImpl.java:62)
      at java.base/jdk.internal.reflect.DelegatingMethodAccessorImpl.invoke(DelegatingMethodAccessorImpl.java:43)
      at java.base/java.lang.reflect.Method.invoke(Method.java:538)
      at com.sun.javatest.regtest.agent.MainActionHelper$SameVMRunnable.run(MainActionHelper.java:230)
      at java.base/java.lang.Thread.run(Thread.java:844)

      JavaTest Message: Test threw exception: java.lang.Error
      JavaTest Message: shutting down test

        Attachments

          Issue Links

            Activity

              People

              • Assignee:
                jjg Jonathan Gibbons
                Reporter:
                jjiang John Jiang
              • Votes:
                0 Vote for this issue
                Watchers:
                14 Start watching this issue

                Dates

                • Created:
                  Updated:
                  Resolved: