Uploaded image for project: 'JDK'
  1. JDK
  2. JDK-8186099

java/rmi/activation test DownloadParameterClass.java fails intermittently: ActivateFailedException

    XMLWordPrintable

    Details

      Description

      java/rmi/activation/Activatable/downloadParameterClass/DownloadParameterClass.java

      Test fails intermittently:

      test result: Failed. Execution failed: `main' threw exception: TestFailedException: TEST FAILED: ; nested exception is: java.rmi.activation.ActivateFailedException: activation failed; nested exception is: java.rmi.activation.ActivationException: object activation failed after 2 tries; nested exception is: java.rmi.ServerError: Error occurred in server thread; nested exception is: java.lang.NoClassDefFoundError: DownloadParameterClass$FooReceiver

        Attachments

          Activity

            People

            Assignee:
            smarks Stuart Marks
            Reporter:
            amlu Amy Lu (Inactive)
            Votes:
            0 Vote for this issue
            Watchers:
            1 Start watching this issue

              Dates

              Created:
              Updated: