Uploaded image for project: 'JDK'
  1. JDK
  2. JDK-8187818

[MVT] Build failures on SPARC

    Details

      Description

      "/scratch/opt/jprt/T/P1/123754.tobias/s/hotspot/src/cpu/sparc/vm/sparc.ad", line 651: Error: Cannot return const Type::Offset from a function that should return long.
      "/scratch/opt/jprt/T/P1/123754.tobias/s/hotspot/src/cpu/sparc/vm/sparc.ad", line 668: Error: Cannot use const Type::Offset to initialize long.
      "/scratch/opt/jprt/T/P1/123754.tobias/s/hotspot/src/cpu/sparc/vm/sparc.ad", line 817: Error: The operation "const Type::Offset == int" is illegal.
      "/scratch/opt/jprt/T/P1/123754.tobias/s/hotspot/src/cpu/sparc/vm/sparc.ad", line 822: Error: The operation "const Type::Offset == int" is illegal.

      "/scratch/opt/jprt/T/P1/081444.tobias/s/hotspot/src/cpu/sparc/vm/interpreterRT_sparc.cpp", line 199: Error: Cannot create a value of the abstract class SlowSignatureHandler.
      1 Error(s) detected.
      make[3]: *** [/scratch/opt/jprt/T/P1/081444.tobias/s/build/solaris-sparcv9-debug/hotspot/variant-server/libjvm/objs/interpreterRT_sparc.o] Error 1
      make[3]: *** Waiting for unfinished jobs....
      "/scratch/opt/jprt/T/P1/081444.tobias/s/hotspot/src/share/vm/interpreter/interpreterRuntime.cpp", line 1594: Error: Cannot create a value of the abstract class InterpreterRuntime::SignatureHandlerGenerator.
      1 Error(s) detected.
      make[3]: *** [/scratch/opt/jprt/T/P1/081444.tobias/s/build/solaris-sparcv9-debug/hotspot/variant-server/libjvm/objs/interpreterRuntime.o] Error 1
      make[2]: *** [hotspot-server-libs] Error 1
      make[2]: *** Waiting for unfinished jobs....

      "/opt/jprt/T/P1/111612.tobias/s/hotspot/src/cpu/sparc/vm/sharedRuntime_sparc.cpp", line 869: Error: "static SharedRuntime::gen_i2c_adapter(MacroAssembler*, int, int, const BasicType*, const VMRegPair*)" was previously declared "static SharedRuntime::gen_i2c_adapter(MacroAssembler*, int, const GrowableArray<SigEntry>&, const VMRegPair*)".
      "/opt/jprt/T/P1/111612.tobias/s/hotspot/src/cpu/sparc/vm/sharedRuntime_sparc.cpp", line 881: Error: "static SharedRuntime::generate_i2c2i_adapters(MacroAssembler*, int, int, const BasicType*, const VMRegPair*, AdapterFingerPrint*)" was previously declared "static SharedRuntime::generate_i2c2i_adapters(MacroAssembler*, int, const GrowableArray<SigEntry>&, const VMRegPair*, AdapterFingerPrint*, AdapterBlob*&)".
      "/opt/jprt/T/P1/111612.tobias/s/hotspot/src/cpu/sparc/vm/sharedRuntime_sparc.cpp", line 884: Error: Formal argument regs of type const VMRegPair* in call to static SharedRuntime::gen_i2c_adapter(MacroAssembler*, int, const GrowableArray<SigEntry>&, const VMRegPair*) is being passed const BasicType*.
      "/opt/jprt/T/P1/111612.tobias/s/hotspot/src/cpu/sparc/vm/sharedRuntime_sparc.cpp", line 884: Error: Too many arguments in call to "static SharedRuntime::gen_i2c_adapter(MacroAssembler*, int, const GrowableArray<SigEntry>&, const VMRegPair*)".

        Attachments

          Activity

            People

            • Assignee:
              thartmann Tobias Hartmann
              Reporter:
              thartmann Tobias Hartmann
            • Votes:
              0 Vote for this issue
              Watchers:
              1 Start watching this issue

              Dates

              • Created:
                Updated:
                Resolved: