Uploaded image for project: 'JDK'
  1. JDK
  2. JDK-8191350

jdk/internal/reflect/CallerSensitive/CheckCSMs.java test fails when -Xmx512m set

    Details

      Backports

        Description

        the test failed in hs PIT with the following message:
        #section:main
        ----------messages:(5/336)----------
        command: main CheckCSMs
        reason: User specified action: run main/othervm/timeout=900 CheckCSMs
        Mode: othervm [/othervm specified]
        Additional options from @modules: --add-modules jdk.jdeps --add-exports jdk.jdeps/com.sun.tools.classfile=ALL-UNNAMED --add-exports jdk.jdeps/com.sun.tools.jdeps=ALL-UNNAMED
        elapsed time (seconds): 312.388
        ----------configuration:(5/184)----------
        Boot Layer
          add modules: jdk.jdeps
          add exports: jdk.jdeps/com.sun.tools.classfile ALL-UNNAMED
                       jdk.jdeps/com.sun.tools.jdeps ALL-UNNAMED

        ----------System.out:(0/0)----------
        ----------System.err:(10/524)----------

        Exception: java.lang.OutOfMemoryError thrown from the UncaughtExceptionHandler in thread "pool-1-thread-2"

        Exception: java.lang.OutOfMemoryError thrown from the UncaughtExceptionHandler in thread "pool-1-thread-1"

        Exception: java.lang.OutOfMemoryError thrown from the UncaughtExceptionHandler in thread "pool-1-thread-3"

        Exception: java.lang.OutOfMemoryError thrown from the UncaughtExceptionHandler in thread "MainThread"

        Exception: java.lang.OutOfMemoryError thrown from the UncaughtExceptionHandler in thread "main"

          Attachments

            Issue Links

              Activity

                People

                • Assignee:
                  mchung Mandy Chung
                  Reporter:
                  iignatyev Igor Ignatyev
                • Votes:
                  0 Vote for this issue
                  Watchers:
                  4 Start watching this issue

                  Dates

                  • Created:
                    Updated:
                    Resolved: